program: QuantumEspresso
programVersion: 6.8
elementType: W S O
lattice: 22.192910 0.000000 0.000000 angstrom
lattice: -11.096455 19.219615 0.000000 angstrom
lattice: 0.000000 0.000000 19.019324 angstrom
elementType: W
elementType: S
elementType: O
formula: O2S98W49
InChI: InChI=1S/O2.98S.49W/c1-2;;;;;;;;;;;;;;;;;;;;;;;;;;;;;;;;;;;;;;;;;;;;;;;;;;;;;;;;;;;;;;;;;;;;;;;;;;;;;;;;;;;;;;;;;;;;;;;;;;;;;;;;;;;;;;;;;;;;;;;;;;;;;;;;;;;;;;;;;;;;;;;;;;;
149 atoms
W  -0.000229 0.003815 -0.00047
S  1.584583 0.918236 1.577168
S  1.585517 0.919173 -1.576001
W  -1.58522 2.749258 0.001205
S  -0.000084 3.664231 1.578087
S  -0.000027 3.664806 -1.575153
W  -3.170439 5.49488 0.0017
S  -1.585215 6.410147 1.578286
S  -1.585217 6.410005 -1.574986
W  -4.755952 8.240303 0.001387
S  -3.170708 9.155319 1.578056
S  -3.170557 9.155534 -1.575004
W  -6.341162 10.985883 0.000848
S  -4.75632 11.900761 1.578031
S  -4.755548 11.901092 -1.575184
W  -7.926235 13.731701 0.000257
S  -6.341688 14.646688 1.577663
S  -6.340283 14.646797 -1.575583
W  -9.511251 16.477266 -0.000273
S  -7.926766 17.392403 1.577203
S  -7.925669 17.392974 -1.576014
W  3.170304 0.003453 0.000888
S  4.755355 0.918207 1.577962
S  4.755843 0.918702 -1.575259
W  1.585164 2.749213 0.001252
S  3.170388 3.664145 1.57814
S  3.170683 3.664396 -1.574993
W  0.000007 5.49488 0.001696
S  1.585386 6.410069 1.578204
S  1.585357 6.409798 -1.574949
W  -1.585222 8.240352 0.001522
S  0.000264 9.155323 1.578051
S  0.000109 9.155538 -1.575006
W  -3.170643 10.985779 0.001698
S  -1.585226 11.900506 1.578502
S  -1.585228 11.901001 -1.574545
W  -4.75587 13.73131 0.001653
S  -3.170839 14.646282 1.578633
S  -3.170279 14.646157 -1.574576
W  -6.340994 16.477206 0.001034
S  -4.755994 17.392186 1.577971
S  -4.755312 17.39225 -1.575104
W  6.340778 0.00304 0.001456
S  7.925998 0.917854 1.578215
S  7.926129 0.917983 -1.575062
W  4.75569 2.748854 0.001647
S  6.341007 3.663752 1.578369
S  6.341031 3.663832 -1.574833
W  3.170586 5.494651 0.00168
S  4.755996 6.410069 1.577998
S  4.756012 6.409286 -1.574946
W  1.585513 8.240307 0.00138
S  3.171054 9.155645 1.577596
S  3.170586 9.155301 -1.57557
W  0.000191 10.985785 0.001696
S  1.585865 11.900766 1.578027
S  1.585091 11.901096 -1.575188
W  -1.585224 13.731159 0.002255
S  0.000393 14.646284 1.578633
S  -0.000169 14.64616 -1.574578
W  -3.170546 16.476662 0.001822
S  -1.58522 17.391838 1.578258
S  -1.58522 17.391625 -1.574689
W  9.511237 0.002683 0.001625
S  11.09647 0.917845 1.57822
S  11.096342 0.917976 -1.575064
W  7.926047 2.748348 0.0017
S  9.511237 3.663601 1.578209
S  9.51124 3.663597 -1.574747
W  6.341169 5.49429 0.001762
S  7.926295 6.410158 1.57808
S  7.926233 6.409075 -1.57514
W  4.755972 8.240203 0.00091
S  6.341275 9.156044 1.576859
S  6.34096 9.154795 -1.576289
W  3.170714 10.985888 0.000843
S  4.756402 11.901301 1.576786
S  4.755175 11.901203 -1.576462
W  1.585424 13.731315 0.001651
S  3.17124 14.646683 1.577665
S  3.169835 14.646797 -1.57559
W  0.000107 16.476664 0.001822
S  1.585552 17.392179 1.577976
S  1.584871 17.392248 -1.575106
W  12.68169 0.003034 0.00146
S  14.267111 0.918196 1.577974
S  14.266625 0.918693 -1.575262
W  11.096428 2.748339 0.001702
S  12.681466 3.663739 1.578375
S  12.681444 3.663821 -1.574833
W  9.51124 5.494234 0.001711
S  11.096184 6.410151 1.578085
S  11.096248 6.409068 -1.575137
W  7.926224 8.240127 0.000615
S  9.511233 9.156344 1.576666
S  9.511233 9.15464 -1.576629
W  6.340965 10.985921 -0.000459
S  7.926331 11.901711 1.575459
S  7.925794 11.900599 -1.578002
W  4.75579 13.731696 0.000253
S  6.34187 14.646843 1.576476
S  6.339855 14.647216 -1.577461
W  3.17055 16.477201 0.001034
S  4.756322 17.392395 1.577208
S  4.755224 17.392972 -1.576018
W  15.85216 0.003447 0.00089
S  17.437886 0.918232 1.577175
S  17.436949 0.91917 -1.576001
W  14.266783 2.748845 0.001651
S  15.852085 3.66414 1.578151
S  15.851789 3.664391 -1.574993
W  12.68131 5.494279 0.001764
S  14.266483 6.410062 1.578005
S  14.26647 6.409279 -1.574942
W  11.096242 8.240123 0.000617
S  12.681193 9.156044 1.576857
S  12.68151 9.154793 -1.57628
W  9.511226 10.98595 -0.001061
S  11.09612 11.901713 1.575461
S  11.096661 11.900606 -1.577996
W  7.925605 13.731361 -0.00206
S  9.511226 14.644255 1.573721
S  9.511231 14.647187 -1.578087
W  6.340805 16.477257 -0.000277
S  7.925361 17.393511 1.575741
S  7.926056 17.392716 -1.576793
W  19.022699 0.003813 -0.000468
S  20.607692 0.918001 1.577086
S  20.60769 0.919525 -1.576653
W  17.437306 2.749213 0.001256
S  19.022561 3.664234 1.578091
S  19.022499 3.664808 -1.575153
W  15.851896 5.494645 0.001684
S  17.437096 6.410067 1.578213
S  17.437122 6.409796 -1.574946
W  14.266503 8.240196 0.000914
S  15.851417 9.15564 1.577603
S  15.851885 9.155299 -1.575566
W  12.681492 10.985925 -0.000455
S  14.266055 11.901305 1.576786
S  14.267285 11.901207 -1.576451
W  11.096852 13.731366 -0.002055
S  12.680594 14.646852 1.576476
S  12.682606 14.647223 -1.57745
W  9.511233 16.477206 0.000031
S  11.097105 17.393518 1.575741
S  11.096415 17.392719 -1.576791
O  10.121778 16.23647 4.735796
O  8.902288 16.23906 4.735736
fermiener: -0.4471 electronvolt
totalener: -131813.980713 electronvolt
