program: QuantumEspresso
programVersion: 6.8
elementType: W S
lattice: 22.192910 0.000000 0.000000 angstrom
lattice: -11.096455 19.219615 0.000000 angstrom
lattice: 0.000000 0.000000 19.019324 angstrom
elementType: W
elementType: S
formula: S97W49
InChI: InChI=1S/97S.49W
146 atoms
W  0.019769 0.033957 -0.016778
S  1.643838 1.041904 1.500724
S  1.578864 0.949142 -1.63062
W  -1.562851 2.760598 -0.016875
S  0.088403 3.692596 1.526182
S  -0.007916 3.655128 -1.646956
W  -3.166043 5.496556 -0.010275
S  -1.559771 6.394967 1.547682
S  -1.604405 6.422182 -1.607375
W  -4.756915 8.241847 0.006576
S  -3.163388 9.146606 1.57948
S  -3.176646 9.163608 -1.571342
W  -6.343113 10.989445 0.015808
S  -4.756908 11.905227 1.590779
S  -4.757616 11.904787 -1.560128
W  -7.926744 13.740008 0.012623
S  -6.343916 14.670137 1.581473
S  -6.341739 14.646251 -1.569278
W  -9.506104 16.495173 -0.001358
S  -7.920019 17.45228 1.545974
S  -7.928377 17.394927 -1.596107
W  3.183429 0.047058 -0.064197
S  4.725769 1.016331 1.494368
S  4.774194 0.902069 -1.668925
W  1.635986 2.853544 -0.11114
S  3.180828 3.656617 -1.752248
W  0.005127 5.490373 -0.064355
S  1.606787 6.31495 1.526635
S  1.595859 6.416294 -1.640382
W  -1.583941 8.235931 -0.008904
S  0.00899 9.122362 1.575017
S  0.004021 9.157451 -1.576393
W  -3.171846 10.986018 0.014141
S  -1.585064 11.892062 1.593886
S  -1.582106 11.901478 -1.555905
W  -4.758413 13.737047 0.014021
S  -3.176873 14.656271 1.591001
S  -3.166691 14.644839 -1.559019
W  -6.342367 16.4915 -0.009945
S  -4.770848 17.426268 1.564376
S  -4.748122 17.385592 -1.588517
W  6.334021 0.017271 -0.039228
S  7.902265 0.933489 1.551238
S  7.941386 0.910917 -1.598795
W  4.738723 2.768523 -0.164438
S  6.246549 3.647564 1.498945
S  6.369272 3.659158 -1.670758
W  3.113805 5.386723 -0.101655
S  4.684306 6.294957 1.505827
S  4.724222 6.398322 -1.626097
W  1.588402 8.213079 -0.013633
S  3.167092 9.112637 1.576407
S  3.170102 9.153532 -1.571944
W  0.00113 10.97403 0.01694
S  1.583804 11.882612 1.599876
S  1.588451 11.898611 -1.550321
W  -1.585952 13.729968 0.023052
S  -0.003953 14.644633 1.603114
S  0.00534 14.643057 -1.547141
W  -3.1747 16.48328 0.008018
S  -1.59601 17.402379 1.588014
S  -1.577195 17.386256 -1.562816
W  9.509091 0.005719 0.001465
S  11.083876 0.924372 1.587647
S  11.10647 0.915704 -1.563439
W  7.912676 2.750527 -0.038443
S  9.477256 3.662387 1.564165
S  9.522893 3.662554 -1.588777
W  6.314602 5.463404 -0.063771
S  7.881501 6.376988 1.546484
S  7.92588 6.413706 -1.596944
W  4.740275 8.206541 -0.012896
S  6.32043 9.1121 1.581132
S  6.330161 9.149715 -1.569831
W  3.168859 10.969995 0.021303
S  4.752953 11.881058 1.603298
S  4.75519 11.89779 -1.545561
W  1.586083 13.724863 0.031987
S  3.170421 14.640776 1.610721
S  3.174449 14.643261 -1.538907
W  -0.000091 16.476402 0.025455
S  1.581713 17.395384 1.604716
S  1.591877 17.388646 -1.545359
W  12.682888 0.004641 0.02469
S  14.267604 0.924162 1.601609
S  14.272507 0.916401 -1.548757
W  11.09074 2.750938 0.007333
S  12.671916 3.666526 1.589796
S  12.685924 3.663337 -1.560494
W  9.500565 5.490619 -0.010637
S  11.077078 6.402313 1.580561
S  11.098148 6.412992 -1.570355
W  7.91505 8.22849 -0.000681
S  9.496859 9.139557 1.587383
S  9.507662 9.159544 -1.562445
W  6.33586 10.968546 0.024217
S  7.921712 11.888992 1.60206
S  7.920554 11.900382 -1.545823
W  4.757707 13.724959 0.036277
S  6.345472 14.645083 1.610997
S  6.341841 14.645869 -1.538728
W  3.173573 16.475679 0.035724
S  4.761351 17.396676 1.609665
S  4.760119 17.390473 -1.540053
W  15.858194 0.006463 0.030069
S  17.452398 0.929719 1.597565
S  17.439894 0.917612 -1.553082
W  14.268365 2.751475 0.021287
S  15.86013 3.669615 1.592128
S  15.852844 3.662827 -1.558138
W  12.677045 5.495788 0.012641
S  14.263987 6.410067 1.589563
S  14.263758 6.411898 -1.561513
W  11.090418 8.238463 0.012133
S  12.675536 9.153423 1.591531
S  12.677902 9.159888 -1.558908
W  9.508068 10.982481 0.023303
S  11.095256 11.903338 1.598045
S  11.091275 11.905289 -1.552057
W  7.928306 13.730869 0.033092
S  9.520181 14.658521 1.601449
S  9.509395 14.652161 -1.546611
W  6.347523 16.479227 0.035105
S  7.94199 17.406214 1.601332
S  7.928017 17.394232 -1.547734
W  19.034393 0.013143 0.018289
S  20.641541 0.943139 1.572867
S  20.60749 0.919903 -1.575743
W  17.447069 2.754639 0.014576
S  19.054149 3.673259 1.572865
S  19.020364 3.661273 -1.578941
W  15.851903 5.497039 0.012499
S  17.448891 6.4086 1.578433
S  17.427852 6.413243 -1.572543
W  14.263809 8.242185 0.015209
S  15.853452 9.155496 1.588617
S  15.846099 9.160423 -1.562703
W  12.67872 10.988923 0.019805
S  14.26629 11.909528 1.591882
S  14.262464 11.904425 -1.558528
W  11.098725 13.738019 0.022992
S  12.688767 14.670084 1.587228
S  12.677593 14.649906 -1.562607
W  9.523594 16.491125 0.022501
S  11.12316 17.433847 1.579181
S  11.096071 17.404257 -1.572033
fermiener: 1.3222 electronvolt
totalener: -130612.946916 electronvolt
