program: QuantumEspresso
programVersion: 6.8
elementType: W S
lattice: 15.852116 0.000000 0.000000 angstrom
lattice: -7.926058 13.728329 0.000000 angstrom
lattice: 0.000000 0.000000 19.022539 angstrom
elementType: W
elementType: S
formula: S49W25
InChI: InChI=1S/49S.25W
74 atoms
W  0.017033 0.020898 0.009134
S  1.651389 0.980606 1.553696
S  1.5736 0.92771 -1.613175
W  -1.55732 2.756926 0.010342
S  0.126884 3.662094 1.532315
S  0.024368 3.647681 -1.595555
W  -3.1629 5.495417 0.013561
S  -1.546204 6.395145 1.565736
S  -1.585502 6.408606 -1.574928
W  -4.755936 8.240474 0.010418
S  -3.165961 9.156861 1.581361
S  -3.169019 9.153028 -1.566535
W  -6.339577 10.989709 0.004759
S  -4.75543 11.924128 1.565238
S  -4.755947 11.886543 -1.587413
W  3.171118 0.012488 -0.037538
S  4.691207 0.979154 1.553422
S  4.768053 0.92515 -1.615378
W  1.70392 2.751791 -0.072073
S  3.171175 3.682784 -1.715292
W  0.038606 5.492906 -0.034493
S  1.645472 6.346674 1.52747
S  1.576346 6.4413 -1.638941
W  -1.579069 8.238754 0.005076
S  0.009403 9.142085 1.582853
S  -0.001864 9.170923 -1.567319
W  -3.171785 10.989676 0.004201
S  -1.600596 11.9167 1.5878
S  -1.581304 11.910334 -1.561655
W  6.324562 0.019974 0.007907
S  7.899785 0.936534 1.594208
S  7.926323 0.92599 -1.552128
W  4.639314 2.747498 -0.074786
S  6.213984 3.659754 1.531112
S  6.317696 3.647729 -1.59676
W  3.167771 5.479745 -0.131211
S  4.692867 6.345629 1.526476
S  4.763331 6.440349 -1.637948
W  1.589341 8.236498 -0.01064
S  3.170227 9.140647 1.576449
S  3.170537 9.177649 -1.56973
W  -0.003915 10.991775 0.020999
S  1.580299 11.904107 1.602029
S  1.584191 11.915573 -1.546263
W  9.504889 0.01385 0.032419
S  11.096572 0.929381 1.608478
S  11.097117 0.927073 -1.537481
W  7.898791 2.756328 0.009316
S  9.48464 3.672341 1.595977
S  9.506395 3.660644 -1.552504
W  6.301216 5.491519 -0.034263
S  7.885993 6.394325 1.565824
S  7.925134 6.408283 -1.574309
W  4.750905 8.236249 -0.010475
S  6.330887 9.141724 1.583395
S  6.34239 9.17096 -1.566679
W  3.170558 10.993523 0.023097
S  4.760625 11.904177 1.602509
S  4.757459 11.915853 -1.545642
W  12.688841 0.014146 0.033063
S  14.293777 0.937131 1.595282
S  14.267753 0.926507 -1.551047
W  11.0967 2.759316 0.032334
S  12.708217 3.672818 1.596297
S  12.687311 3.660659 -1.552149
W  9.503193 5.495134 0.013569
S  11.096118 6.410924 1.588076
S  11.096055 6.405921 -1.559557
W  7.919327 8.238516 0.005635
S  9.506479 9.156648 1.581797
S  9.50899 9.153061 -1.566111
W  6.345014 10.991894 0.021822
S  7.941853 11.917052 1.588667
S  7.92236 11.911271 -1.560634
fermiener: 1.3703 electronvolt
totalener: -66489.937403 electronvolt
