program: Gaussian 09
title: 000042375
version: EM64L-G09RevD.01
frameworkgroup: C1[X(C13H17Cl2NO2)]
method: RPBEPBE
basis: SDD
operation: Freq
keyword: #p
keyword: freq=noraman
keyword: PBEPBE/SDD
title: #p freq=noraman PBEPBE/SDD
converged: YES YES NO NO
title: Mulliken charges:
elementType: Cl Cl O O N C C C C C C C C C C C C C H H H H H H H H H H H H H H H H H
charge: -0.030075 -0.014382 -0.306130 -0.251722 -0.624691 0.001800 0.328846 0.426535 0.238838 -0.725912 -0.706421 -0.700986 -0.705740 -0.345752 -0.409224 -0.075614 -0.195577 -0.127849 0.252166 0.212930 0.241838 0.220200 0.215287 0.266634 0.228454 0.228888 0.209774 0.266153 0.215129 0.229273 0.299107 0.285529 0.291437 0.304926 0.256334
chargesum: 0.00000
title: Mulliken charges with hydrogens summed into heavy atoms:
elementType: Cl Cl O O N C C C C C C C C C C C C C
charge: -0.030075 -0.014382 -0.306130 -0.251722 -0.040056 0.001800 0.328846 0.426535 0.238838 -0.018979 -0.004301 -0.033871 0.004815 -0.054315 -0.104298 -0.075614 0.060757 -0.127849
polarizability: 2.13134311e+02 7.03965813e+00 1.87381796e+02 1.10487809e+01 -8.64224259e+00 1.17722079e+02
1716.lowfreq: -14.6636 -5.9403 -0.0023 -0.0019 -0.0011 2.1493 18.4188 32.9029 37.3265
frequency: 17.8369 32.7388 37.2479 74.7825 109.5960 120.9928 136.6095 145.8253 177.5284 182.0605 190.1317 209.0858 215.3285 231.8016 240.3084 253.6277 257.6136 289.5742 305.4918 330.1927 337.4891 345.1945 363.4234 398.8239 419.2887 432.4373 440.8597 444.0318 463.4774 510.1148 549.5999 580.3720 647.3965 667.4325 707.0906 710.2092 732.3144 755.1359 785.3965 804.2526 843.1519 857.0322 907.5338 917.4207 922.1544 953.6265 954.7441 993.5990 1000.2668 1004.2437 1028.7885 1032.3831 1066.6758 1118.3745 1124.8968 1126.2416 1167.0504 1194.3390 1220.7241 1252.3033 1258.3391 1272.9033 1295.8470 1354.6655 1375.2450 1377.3350 1379.8341 1384.6587 1402.1174 1446.1055 1447.6133 1464.5454 1467.7258 1468.8934 1471.2893 1473.0267 1480.8722 1502.0304 1564.0200 1588.0185 1606.5807 1654.4266 2990.0929 2990.6972 2991.4263 2996.4367 3082.2656 3084.7402 3085.2960 3094.7931 3097.8638 3115.0931 3119.5525 3127.1055 3157.4157 3165.7396 3175.2058 3434.0376 3561.1932
redmass: 6.3485 3.5135 5.2739 5.5446 6.2379 3.8896 3.8116 5.0470 1.1099 19.7467 4.8934 1.4207 2.3693 1.4999 1.2783 1.0917 1.4971 2.6697 3.9686 3.3911 3.7403 3.9682 4.9842 3.0752 3.4719 4.3435 2.8638 3.0952 3.5155 4.6196 5.4134 5.9689 4.7610 5.1801 3.2058 4.5158 3.8409 2.6223 6.7138 3.3733 1.3714 3.1588 1.4382 1.5902 1.6250 2.1633 1.2118 1.3286 2.8447 2.1612 1.4190 1.4234 2.2514 1.7420 1.5383 3.6370 2.7877 2.7339 3.8881 1.3265 3.0118 3.0746 1.9670 4.4852 4.9225 1.2320 1.2337 1.2565 1.2144 1.0513 2.4089 1.0518 1.0552 1.0744 1.0597 1.0728 1.0525 1.0580 8.2757 7.3137 9.0781 1.0981 1.0356 1.0379 1.0364 1.0370 1.0994 1.0992 1.0987 1.0993 1.1003 1.1003 1.0994 1.0990 1.0884 1.0914 1.0962 1.0460 1.0955
irintensity: 0.2142 0.0138 0.8671 0.4384 0.5697 0.6058 0.6606 1.4832 0.0379 0.0703 2.6529 20.3434 2.7750 1.9639 0.1057 3.7537 16.0351 2.6657 3.8268 5.2962 12.1706 1.2247 18.4527 3.4780 1.0459 3.0606 2.7782 4.3807 23.0337 3.9394 11.1474 10.1234 17.9632 53.9193 61.3566 12.2689 66.0514 114.9525 11.4208 4.2586 26.5473 24.5861 14.0816 1.1144 1.3627 24.3008 0.6244 3.0035 26.9312 32.2673 0.0997 0.3016 221.9516 31.6880 73.3349 127.3518 40.1976 9.6224 43.3606 5.3769 26.9783 12.2822 16.2743 12.9127 5.7891 42.6538 30.5623 28.1633 26.9760 0.0654 89.4603 9.2526 2.2287 18.6099 22.9246 11.0317 3.6719 28.8081 13.8944 14.2907 150.2304 45.2069 9.9327 23.2340 27.9224 22.3337 6.2686 17.8035 26.4599 62.1544 31.8783 3.4993 14.8415 12.1032 1.1359 1.3533 7.4486 3.9405 7.7543
temp: 298.150 k
press: 1.00000 atm
elementType: 17 17 8 8 7 6 6 6 6 6 6 6 6 6 6 6 6 6 1 1 1 1 1 1 1 1 1 1 1 1 1 1 1 1 1
symmnumber: 1
zpe: 719812.9 jmol-1
zpe.correction: 0.274162 hartree
zpe.thermalcorrener: 0.294224 hartree
zpe.thermalcorrenthalpy: 0.295168 hartree
zpe.thermalcorrgfe: 0.224953 hartree
zpe.sumelectzpe: -1629.542587 hartree
zpe.sumelectthermal: -1629.522526 hartree
zpe.sumelectthermalent: -1629.521581 hartree
zpe.sumelectthermalfe: -1629.591797 hartree
dipole: 4.2625 0.6572 1.1531
dipole: 4.4643
quadrupole: -120.1482 -114.2295 -123.3993
quadrupole: -8.8204 4.7658 2.5732
quadrupole: -0.8892 5.0295 -4.1404 -8.8204 4.7658 2.5732
hfenergy: -1629.8167497 hartree
pointgroup: C01 [X(C13H17Cl2N1O2)]
dipole: -1.652768 -0.484998 0.3436258 debye
polarizability: 211.9515546|11.1628489|182.3677929|-8.7190403|21.8023817|123.9188388 unknown
InChI: InChI=1S/C13H17Cl2NO2/c1-12(2,3)18-11(17)13(4,16)8-5-6-9(14)10(15)7-8/h5-7H,16H2,1-4H3
charge 0 multiplicity 1
35 atoms
Cl 2.463046 2.636022 1.255233
Cl 5.053143 1.113019 -0.103234
O  -1.974557 0.178013 0.520842
O  -1.998041 -0.889113 -1.563139
N  -0.422148 -2.966038 -0.599099
C  -0.457396 -1.7253 0.1947
C  -3.00876 1.258776 0.146563
C  0.907124 -0.984368 0.098368
C  -1.563679 -0.775447 -0.391045
C  -0.744638 -2.083221 1.676396
C  -4.343954 0.570769 -0.195535
C  -3.103025 2.069897 1.449061
C  -2.452252 2.104577 -1.014479
C  1.067028 0.320912 0.626568
C  2.024671 -1.631238 -0.478811
C  2.319118 0.960514 0.567752
C  3.279186 -0.988266 -0.535263
C  3.429455 0.312233 -0.012773
H  -0.746047 -1.183451 2.308748
H  -1.730424 -2.5749 1.77712
H  0.038446 -2.773124 2.035508
H  -4.672096 -0.075727 0.637646
H  -5.119429 1.341884 -0.356363
H  -4.256662 -0.035366 -1.110466
H  -2.128011 2.520632 1.703617
H  -3.422004 1.427238 2.28758
H  -3.841539 2.882581 1.329154
H  -2.373604 1.513326 -1.939915
H  -3.131175 2.957413 -1.197365
H  -1.456596 2.509241 -0.760078
H  -0.60659 -2.791805 -1.595831
H  -1.045234 -3.69099 -0.228596
H  0.220395 0.842804 1.080975
H  1.888788 -2.645616 -0.863477
H  4.144063 -1.488682 -0.980859
