program: Gaussian 09
title: 000042492
version: EM64L-G09RevD.01
frameworkgroup: C1[X(C22H25Cl2N3O3)]
method: RPBEPBE
basis: SDD
operation: Freq
keyword: #p
keyword: freq=noraman
keyword: PBEPBE/SDD
title: #p freq=noraman PBEPBE/SDD
converged: YES YES NO NO
title: Mulliken charges:
elementType: Cl Cl O O O N N N C C C C C C C C C C C C C C C C C C C C C C H H H H H H H H H H H H H H H H H H H H H H H H H
charge: -0.043545 -0.055929 -0.299130 -0.339211 -0.258168 -0.078322 -0.425036 -0.431645 -0.066664 -0.456338 -0.431916 -0.385485 -0.386663 -0.475286 0.449278 0.154182 0.119211 -0.378829 -0.448318 0.291815 -0.227587 -0.221216 -0.354798 -0.245804 -0.485724 -0.462676 0.694277 -0.525897 0.258082 -0.675633 0.269168 0.209969 0.214193 0.211792 0.238664 0.157490 0.221044 0.238565 0.193370 0.189418 0.219640 0.369987 0.264156 0.230039 0.224691 0.224026 0.308704 0.227227 0.323680 0.337195 0.240535 0.240216 0.240363 0.299374 0.299469
chargesum: 0.00000
title: Mulliken charges with hydrogens summed into heavy atoms:
elementType: Cl Cl O O O N N N C C C C C C C C C C C C C C C C C C C C C C
charge: -0.043545 -0.055929 -0.299130 -0.339211 -0.258168 -0.078322 -0.055049 -0.094450 0.202504 -0.032176 0.018540 -0.006951 0.045271 -0.066228 0.449278 0.154182 0.119211 -0.114673 -0.218280 0.291815 -0.002896 0.002810 -0.046093 -0.018578 -0.162044 -0.462676 0.694277 0.195218 0.258082 -0.076790
polarizability: 4.11841842e+02 2.18079269e+01 2.82845624e+02 8.88314582e+00 -2.25012477e+01 2.13095297e+02
1716.lowfreq: -8.7165 -2.7785 -0.0011 0.0013 0.0020 1.7897 7.9978 10.7438 24.3498
frequency: 5.6158 10.5028 24.3102 29.2678 34.2459 40.8297 53.4310 58.5685 68.4203 78.0593 83.3967 93.1349 112.4962 128.2618 141.9579 164.8877 171.3261 196.9255 202.4832 216.0846 220.2936 240.4019 250.2495 266.3910 287.8827 306.5617 319.7522 328.5915 347.6019 364.8542 371.6819 395.1597 403.9016 405.3599 418.3895 433.3062 460.9389 463.3740 485.0238 521.0745 533.4898 556.8837 593.5919 598.9014 616.1429 618.7454 635.3342 665.7605 676.1399 693.2765 699.9553 704.9989 708.0061 737.8539 751.3370 759.0854 772.1394 794.2142 803.5744 805.0604 824.8253 859.6242 881.5115 902.5392 903.2836 908.0488 919.9038 939.0764 941.1082 955.8138 969.2619 981.8324 986.2634 989.9313 994.5405 1003.2031 1013.9492 1023.3014 1025.2471 1051.8251 1076.6439 1094.1979 1100.0283 1114.3950 1116.1657 1135.9116 1143.4508 1155.2475 1155.3882 1168.1645 1169.8888 1180.5920 1184.7978 1191.0689 1211.2436 1229.3833 1234.3168 1248.0631 1253.2371 1261.8709 1267.4779 1279.3636 1291.8277 1306.5923 1311.9047 1331.8695 1341.6854 1343.8539 1358.3423 1369.6638 1379.8737 1381.5020 1396.5240 1399.9138 1418.8182 1440.3944 1444.2956 1446.0536 1456.9917 1458.7768 1462.3856 1468.6351 1473.2968 1476.9716 1481.6064 1483.0280 1506.5319 1520.9060 1571.5694 1594.0643 1594.5087 1599.7650 1614.6692 1618.4358 2783.1143 2833.7280 2845.2514 2980.1888 2980.8100 2997.1287 3001.2215 3019.1032 3030.8203 3047.9928 3062.7478 3068.4591 3071.6679 3078.7022 3112.2880 3122.6814 3129.9849 3135.4630 3146.5003 3149.0668 3158.5434 3161.3340 3192.0592 3404.5794 3446.6959
redmass: 6.4839 7.0298 10.0215 4.0197 5.1940 4.0565 6.6163 6.3568 5.2507 3.2561 5.2904 5.2467 5.7859 4.8658 7.2988 5.0285 5.4811 4.3683 4.9866 3.7576 1.5269 2.8309 7.7521 3.8180 2.5771 3.0046 2.7247 9.3216 3.2156 5.2473 3.6269 10.6947 2.9826 2.8500 2.7628 5.6651 3.1018 3.2332 3.6948 6.4215 3.6879 3.3677 4.8667 4.3576 6.3840 6.6077 6.9193 6.4644 2.5922 1.1509 6.0479 2.2270 3.6165 1.6265 6.4826 4.4167 2.8519 1.2558 1.8729 2.9320 4.1726 1.2494 3.2189 1.5428 2.0795 1.7336 1.4794 5.9994 1.3727 5.0317 3.0717 1.4274 1.7837 5.0324 2.1238 1.5047 1.6082 3.7983 2.1196 2.2516 1.6172 1.4910 4.0466 1.2562 2.6859 2.6738 2.5646 1.1984 1.3175 1.9114 1.0612 1.1122 1.1366 1.3036 2.5446 2.4576 2.3097 1.5096 1.4432 1.2090 1.5964 3.1599 1.4287 1.5772 1.3828 1.4261 1.4040 1.4201 1.3894 1.4985 4.8307 3.1299 1.8314 4.9808 1.1005 2.0897 1.3085 1.0897 1.1015 1.1279 2.1118 1.0578 1.1245 1.2050 1.6615 1.3587 1.8704 3.1194 3.8301 6.1661 7.8874 5.0115 6.1330 7.1724 1.0709 1.0715 1.0699 1.0859 1.0313 1.0633 1.0625 1.0841 1.0847 1.0879 1.1020 1.0566 1.1015 1.1051 1.0867 1.0862 1.1021 1.0915 1.0955 1.1090 1.0918 1.1014 1.0910 1.0767 1.0796
irintensity: 0.1462 0.4523 0.0385 0.0036 0.1328 0.2174 1.6474 5.8334 0.5625 12.3872 4.9007 0.0609 0.5950 3.5892 8.3677 4.4605 1.7859 1.0192 3.1169 3.7607 0.9061 0.2972 1.5387 6.0792 0.2421 3.4635 0.1470 5.9964 9.4982 4.5601 0.6975 24.1024 4.8458 0.0278 3.4455 19.6182 7.8727 8.1952 0.8436 9.2842 5.0469 0.1878 12.3077 2.9744 0.4861 29.5525 6.3665 6.5354 2.8891 86.3292 119.7951 29.5039 6.3074 54.6469 4.3787 1.9359 18.1000 57.1994 3.9885 6.4905 12.7727 0.4224 3.1510 32.9576 3.1188 17.4617 3.5875 10.2925 20.4114 9.7725 29.6762 2.1660 9.2431 3.1758 37.5157 4.2014 9.8374 3.9825 12.2015 23.2295 17.9536 7.0782 51.9841 0.1007 47.8491 2.8006 26.5096 2.8338 4.0928 35.2046 0.6478 3.0575 5.8254 5.5369 4.4238 21.8390 123.1819 18.6901 36.7609 35.4756 13.7846 47.1883 34.0374 10.4272 19.4907 18.0918 16.0350 6.3722 5.9761 1.7179 60.9007 3.4629 6.4217 34.6509 32.2900 11.5173 22.1749 18.7828 36.0361 25.7196 146.8284 13.3356 8.8356 10.5433 10.5053 94.6644 902.4005 59.9857 77.2658 7.9334 486.4442 4.6975 7.9582 94.2718 155.4046 34.9711 168.6787 21.5419 40.7368 19.0850 19.2148 58.1318 41.2093 29.0959 33.4268 3.3780 38.0808 27.9194 9.2522 0.1709 20.9157 19.5626 31.7170 0.5439 13.4253 29.3103 13.2438 100.0252 82.5683
temp: 298.150 k
press: 1.00000 atm
elementType: 17 17 8 8 8 7 7 7 6 6 6 6 6 6 6 6 6 6 6 6 6 6 6 6 6 6 6 6 6 6 1 1 1 1 1 1 1 1 1 1 1 1 1 1 1 1 1 1 1 1 1 1 1 1 1
symmnumber: 1
zpe: 1144113.6 jmol-1
zpe.correction: 0.435770 hartree
zpe.thermalcorrener: 0.464691 hartree
zpe.thermalcorrenthalpy: 0.465635 hartree
zpe.thermalcorrgfe: 0.370249 hartree
zpe.sumelectzpe: -2161.200447 hartree
zpe.sumelectthermal: -2161.171526 hartree
zpe.sumelectthermalent: -2161.170581 hartree
zpe.sumelectthermalfe: -2161.265967 hartree
dipole: 0.2167 -4.7619 2.7799
dipole: 5.5182
quadrupole: -186.3316 -196.3509 -186.3111
quadrupole: 8.5678 -2.9405 3.5834
quadrupole: 3.3330 -6.6864 3.3534 8.5678 -2.9405 3.5834
hfenergy: -2161.6362164 hartree
pointgroup: C01 [X(C22H25Cl2N3O3)]
dipole: 0.0717022 -1.7735012 1.2501927 debye
polarizability: 410.6581875|24.9685086|279.1695911|12.968642|-27.2318979|217.9549834 unknown
InChI: InChI=1S/C22H25Cl2N3O3/c1-30-20-12-19(26-21(28)13-23)18(24)11-17(20)22(29)25-16-7-9-27(10-8-16)14-15-5-3-2-4-6-15/h2-6,11-12,16,25-26H,7-10,13-14H2,1H3
charge 0 multiplicity 1
55 atoms
Cl -5.546761 1.943801 -2.113787
Cl -8.562135 -1.164565 -1.357961
O  -0.569152 3.244838 -0.965383
O  -1.091611 -0.376405 1.233256
O  -5.412372 -2.549109 0.819831
N  3.833539 0.425876 0.70043
N  0.40288 1.74729 0.523391
N  -5.702495 -0.630356 -0.524826
C  1.693146 2.468138 0.559314
C  2.447818 2.139006 1.86726
C  2.582721 2.102126 -0.659872
C  2.981852 0.690398 1.881907
C  3.095994 0.65382 -0.571101
C  4.46821 -0.911516 0.758379
C  5.625095 -1.077131 -0.223478
C  -0.643412 2.186548 -0.253872
C  -1.916987 1.365506 -0.235468
C  6.523909 -0.007664 -0.466778
C  5.848702 -2.318492 -0.867711
C  -2.14937 0.139426 0.459898
C  7.625634 -0.179266 -1.333218
C  6.954099 -2.495402 -1.731729
C  -2.98116 1.883717 -1.012457
C  7.847271 -1.425198 -1.967156
C  -3.387629 -0.532708 0.376912
C  -4.207433 1.223231 -1.094178
C  -4.441033 0.002641 -0.405754
C  -1.286726 -1.652322 1.936125
C  -6.111403 -1.810661 0.057596
C  -7.536201 -2.288888 -0.235383
H  1.456476 3.546585 0.510895
H  1.792517 2.309321 2.742574
H  3.309223 2.827066 1.948813
H  3.447488 2.79246 -0.68357
H  2.005459 2.250297 -1.589619
H  2.120908 -0.034383 1.937695
H  3.58555 0.529865 2.795072
H  3.780822 0.444052 -1.411234
H  2.232884 -0.05707 -0.662489
H  3.725333 -1.73479 0.590682
H  4.852766 -1.043212 1.79085
H  0.272737 0.877072 1.052365
H  6.333099 0.954475 0.021776
H  5.153604 -3.150414 -0.695781
H  8.311697 0.656172 -1.515061
H  7.113719 -3.461695 -2.223859
H  -2.78958 2.820695 -1.545268
H  8.702538 -1.558301 -2.639348
H  -3.575511 -1.469776 0.901873
H  -6.392761 -0.148595 -1.119597
H  -2.103639 -1.57564 2.676557
H  -1.502185 -2.467235 1.221218
H  -0.332453 -1.843628 2.448514
H  -7.495851 -3.267718 -0.735455
H  -8.09333 -2.37158 0.709211
