program: Gaussian 09
title: 000042349
version: EM64L-G09RevD.01
frameworkgroup: C1[X(C17H23ClN2O2)]
method: RPBEPBE
basis: SDD
operation: Freq
keyword: #p
keyword: freq=noraman
keyword: PBEPBE/SDD
title: #p freq=noraman PBEPBE/SDD
converged: YES YES NO NO
title: Mulliken charges:
elementType: Cl O O N N C C C C C C C C C C C C C C C C C H H H H H H H H H H H H H H H H H H H H H H H
charge: -0.064252 -0.251189 -0.236397 -0.095320 -0.192039 0.022898 -0.373079 -0.365127 -0.392627 -0.399088 -0.402447 -0.497539 -0.762711 0.319521 0.154069 -0.180762 0.190218 -0.234106 -0.684826 -0.343652 -0.168746 -0.242510 0.205968 0.167615 0.233428 0.199549 0.180490 0.205137 0.193304 0.194317 0.207239 0.190075 0.217147 0.246097 0.282621 0.234815 0.230152 0.230684 0.261118 0.276831 0.230157 0.246725 0.246116 0.259844 0.260283
chargesum: 0.00000
title: Mulliken charges with hydrogens summed into heavy atoms:
elementType: Cl O O N N C C C C C C C C C C C C C C C C C
charge: -0.064252 -0.251189 -0.236397 -0.095320 -0.192039 0.228866 0.027964 0.014912 0.005814 0.002468 0.004775 0.031179 -0.067059 0.319521 0.154069 0.080356 0.190218 0.042725 0.038171 -0.083808 -0.168746 0.017772
polarizability: 2.47945977e+02 2.12233125e+00 2.59045998e+02 -7.40056725e-01 5.14782926e+00 1.35633273e+02
1716.lowfreq: -15.8588 -8.1793 -0.0015 -0.0012 0.0014 2.5065 19.5024 23.1851 32.3445
frequency: 16.7051 22.2512 32.3176 59.0204 76.8476 84.1959 110.5810 125.1558 151.1616 166.0160 190.6737 216.9845 223.5816 234.0134 257.3198 287.0821 296.3198 319.0834 331.8380 344.2829 348.5236 378.1691 386.1631 391.5686 402.9739 432.5761 440.7308 457.4251 463.4451 476.7292 512.3871 551.1467 566.5545 585.2315 609.2665 687.5842 693.5183 704.6015 723.5511 748.9232 799.1177 803.5237 812.7382 837.8079 844.6816 846.0461 852.2760 868.7671 890.1456 912.2779 933.5957 949.8405 955.6767 957.6144 990.7281 1019.6379 1041.2184 1051.6219 1062.0319 1068.6947 1081.0509 1099.8619 1112.9067 1120.9808 1127.0793 1133.6655 1143.2956 1149.9051 1162.2866 1192.3674 1232.7793 1242.4502 1258.1994 1260.1512 1269.4300 1284.3787 1292.5673 1295.2372 1302.7728 1321.2815 1331.4577 1336.6671 1340.7168 1346.5635 1351.0390 1356.5947 1359.2789 1381.3559 1382.5754 1388.8222 1394.8392 1422.2622 1448.2852 1456.9523 1458.3472 1463.5318 1464.0873 1465.5918 1470.9483 1474.4766 1477.6545 1481.1695 1490.0678 1574.1426 1601.7847 1617.1870 2822.4577 2828.3268 2846.0596 2967.5534 2985.9595 2986.9167 2993.8453 2995.4014 3024.5120 3034.7767 3035.8943 3046.0951 3055.5835 3072.5974 3085.1614 3091.4658 3096.7050 3101.5067 3103.6797 3106.6706 3164.4554 3184.5036 3191.4594
redmass: 3.3311 4.0539 5.3416 3.8243 4.2701 4.2783 4.3583 5.4901 4.1067 4.8568 4.4946 1.0884 2.0915 3.4349 2.3253 2.0048 2.5923 4.1071 2.7042 5.6583 3.1104 2.1124 3.6869 3.6956 3.3081 3.6364 2.8626 4.6492 2.2486 2.6247 3.3344 3.1848 4.0304 3.1255 6.4377 5.0572 4.3847 5.2769 4.1170 3.4396 2.5605 1.4780 1.7579 2.4562 1.7883 2.1840 1.4559 2.6259 2.0964 2.3923 1.3364 2.1422 1.9819 1.3720 2.8927 2.1236 3.5235 2.0086 2.0549 1.9057 1.9632 2.1909 2.3969 2.3284 1.5793 1.8085 2.0310 1.3820 2.2435 2.5534 2.1173 1.5677 1.4929 1.2654 1.2030 2.1242 1.3348 1.4257 1.5635 1.3812 1.2843 1.5016 1.6012 1.4347 1.6099 1.4446 1.4415 1.3925 1.3460 3.7011 1.3325 3.8171 1.0914 1.0890 1.0899 1.0728 1.0600 1.0930 1.0847 1.0844 1.1182 2.6801 1.0552 7.7125 8.9148 8.2427 1.0719 1.0735 1.0784 1.0626 1.0608 1.0615 1.0350 1.0360 1.0852 1.0709 1.0855 1.1031 1.1032 1.0884 1.0940 1.0974 1.1012 1.0991 1.1028 1.0954 1.0887 1.0972 1.0919
irintensity: 0.0533 0.0892 0.9392 0.6376 1.1088 0.5666 0.1543 3.7132 1.1144 1.1450 0.2292 0.3399 0.6237 2.9772 1.9224 1.7412 1.1189 2.5516 2.6116 1.1766 2.4865 3.0017 5.1783 11.6486 1.2321 3.8752 0.3848 8.7231 0.6123 0.7559 16.9607 5.7753 4.8757 4.7896 14.9881 1.1129 5.7286 8.4034 16.8875 4.9425 10.1692 0.1652 38.0967 19.6763 26.3961 5.0018 8.4842 8.3215 3.4014 2.5971 0.6547 18.2750 7.2174 2.9290 71.0413 5.5413 20.7697 9.6294 17.1436 11.7237 16.2632 7.2943 21.5313 6.2519 42.2153 3.7357 15.1306 3.5819 25.7986 80.4636 38.5729 22.5895 50.2625 1.8810 19.8802 67.8290 4.0895 8.0288 3.0518 19.6176 4.1075 15.2084 32.7428 11.8058 33.3901 0.0509 33.2931 2.4235 33.8736 4.3353 30.3824 22.9373 6.5644 34.0614 1.0723 18.8275 21.2829 8.4719 4.0015 8.6249 12.0306 184.5916 6.1163 88.8416 227.6655 73.5901 46.0542 72.7573 149.1815 37.9278 42.6831 29.7156 9.5686 13.9036 79.5309 13.5238 62.5556 24.8660 77.6849 27.0682 2.2629 43.8199 19.5268 10.9685 6.2493 29.6653 1.4586 1.7546 0.1912
temp: 298.150 k
press: 1.00000 atm
elementType: 17 8 8 7 7 6 6 6 6 6 6 6 6 6 6 6 6 6 6 6 6 6 1 1 1 1 1 1 1 1 1 1 1 1 1 1 1 1 1 1 1 1 1 1 1
symmnumber: 1
zpe: 980011.8 jmol-1
zpe.correction: 0.373267 hartree
zpe.thermalcorrener: 0.394369 hartree
zpe.thermalcorrenthalpy: 0.395313 hartree
zpe.thermalcorrgfe: 0.321868 hartree
zpe.sumelectzpe: -1379.947518 hartree
zpe.sumelectthermal: -1379.926416 hartree
zpe.sumelectthermalent: -1379.925472 hartree
zpe.sumelectthermalfe: -1379.998917 hartree
dipole: 0.4878 0.4293 2.0386
dipole: 2.1397
quadrupole: -125.9462 -151.4869 -141.0506
quadrupole: 2.5235 -2.1023 -7.7853
quadrupole: 13.5484 -11.9924 -1.5560 2.5235 -2.1023 -7.7853
hfenergy: -1380.3207847 hartree
pointgroup: C01 [X(C17H23Cl1N2O2)]
dipole: 0.1843888 0.2384522 0.7859862 debye
polarizability: 248.0093825|2.2758974|258.9026565|0.522786|-6.0541354|135.7132091 unknown
InChI: InChI=1S/C17H23ClN2O2/c1-12(19-8-4-3-5-9-19)11-20-15-10-14(18)6-7-16(15)22-13(2)17(20)21/h6-7,10,12-13H,3-5,8-9,11H2,1-2H3
charge 0 multiplicity 1
45 atoms
Cl -1.121972 4.333714 0.068319
O  -3.688081 -1.073232 -0.55096
O  -0.797226 -3.246481 -0.574738
N  2.880834 -0.310537 0.0881
N  -0.852054 -0.907052 -0.404529
C  1.500597 -0.61528 0.583639
C  4.006193 -0.715169 0.97227
C  3.022552 1.118602 -0.306001
C  5.360584 -0.528654 0.255102
C  4.343048 1.372006 -1.060993
C  5.551758 0.932939 -0.205514
C  0.606763 -0.818122 -0.682716
C  1.416126 -1.85845 1.489413
C  -1.645954 0.274092 -0.27518
C  -1.443027 -2.178029 -0.370483
C  -2.929704 -2.224995 0.010011
C  -3.066082 0.172377 -0.360876
C  -1.067569 1.560092 -0.137234
C  -3.121231 -2.316412 1.535665
C  -3.87881 1.320153 -0.332127
C  -1.901485 2.691848 -0.107636
C  -3.301497 2.603202 -0.208421
H  1.109366 0.251711 1.175881
H  4.01528 -0.117108 1.922464
H  3.887448 -1.77509 1.247294
H  2.174818 1.406506 -0.954526
H  2.982436 1.781942 0.599446
H  5.389536 -1.201482 -0.623802
H  6.176327 -0.83395 0.938705
H  4.415317 2.445432 -1.321772
H  4.32811 0.795298 -2.005763
H  5.632582 1.592741 0.68336
H  6.49315 1.042513 -0.776067
H  0.768742 -0.005965 -1.411464
H  0.904477 -1.768068 -1.155039
H  1.801816 -2.75685 0.976745
H  1.963871 -1.715312 2.436329
H  0.36007 -2.053638 1.743677
H  -3.364578 -3.104109 -0.489389
H  0.013117 1.686504 -0.057578
H  -2.707809 -1.430229 2.049053
H  -4.196599 -2.388642 1.770753
H  -2.614028 -3.217777 1.922019
H  -4.962133 1.194721 -0.414051
H  -3.925375 3.50004 -0.186285
