program: Gaussian 09
title: 000006986
version: EM64L-G09RevD.01
frameworkgroup: C1[X(C10H18O)]
method: RPBEPBE
basis: SDD
operation: Freq
keyword: #pfreq=noraman
keyword: PBEPBE/SDD
title: #p freq=noraman PBEPBE/SDD
converged: YES YES NO NO
title: Mulliken charges:
elementType: O C C C C C C C C C C H H H H H H H H H H H H H H H H H H
charge: -0.193713 -0.123764 -0.477870 -0.017334 -0.434646 -0.090902 -0.534079 0.116714 -0.727632 -0.713323 -0.726826 0.238860 0.213560 0.216793 0.216080 0.196939 0.209700 0.213271 0.240475 0.219355 0.207337 0.219106 0.220405 0.213881 0.208949 0.236945 0.215020 0.217106 0.219591
chargesum: 0.00000
title: Mulliken charges with hydrogens summed into heavy atoms:
elementType: O C C C C C C C C C C
charge: -0.193713 0.115096 -0.047517 0.198746 -0.028006 0.122370 -0.074248 0.116714 -0.080784 -0.053549 -0.075108
polarizability: 1.18233674e+02 1.21389173e+00 1.08219957e+02 1.67113244e+00 4.85422671e-01 9.29231091e+01
1716.lowfreq: -13.8345 0.0006 0.0008 0.0010 14.5103 17.9832 40.0801 69.4597 98.1415
frequency: 25.4015 68.9496 98.0955 155.5846 194.0817 202.6705 213.4335 220.7864 277.0450 322.9775 332.1478 349.8297 391.1137 419.9386 434.6367 462.0723 511.0413 566.3018 662.1094 762.2987 795.7103 826.1075 873.4242 880.5566 914.1176 920.9960 943.7598 955.8020 964.2070 972.9894 1022.6590 1074.2666 1084.9730 1094.4853 1121.4964 1138.6256 1163.8863 1167.4061 1204.2445 1228.8530 1256.3742 1265.1599 1271.3691 1282.8602 1308.9592 1313.8796 1327.1430 1327.7489 1349.5103 1351.3395 1381.0124 1385.1869 1399.3815 1444.8712 1463.0467 1465.6675 1467.0181 1474.0745 1474.9421 1476.2107 1481.3606 1496.9434 1623.2815 2956.7387 2967.3492 2967.6012 2968.4829 2973.0298 2976.3461 2977.8194 2980.3094 3004.5326 3032.0277 3045.7550 3060.9122 3064.1325 3066.1957 3070.2822 3071.9401 3075.9050 3079.0247
redmass: 2.4430 3.5190 4.2547 2.3930 1.1165 2.8608 1.1079 1.1172 2.6763 2.0692 2.7612 2.6474 2.3057 2.1976 2.7614 2.7604 3.0745 2.9758 3.6096 1.9986 2.4320 2.4933 1.8988 2.2620 1.3505 1.5258 1.6573 1.4237 1.7497 1.6277 1.5496 1.6141 1.9607 1.9527 2.0640 2.4763 1.9305 1.8276 1.7445 1.5960 1.6287 1.6085 1.3039 1.3359 1.3171 1.4028 1.3375 1.3703 1.4102 1.6253 1.2061 1.2099 1.2045 1.0908 1.0619 1.0562 1.0784 1.0556 1.0562 1.0464 1.0547 1.0573 9.1618 1.0752 1.0649 1.0670 1.0509 1.0362 1.0394 1.0608 1.0687 1.0848 1.0982 1.0988 1.0977 1.0995 1.0982 1.0991 1.0987 1.0996 1.0985
irintensity: 0.1814 0.8154 3.0303 0.1791 0.0971 0.2812 0.0724 0.0012 1.1883 0.8152 0.8798 0.1943 0.0045 0.2078 3.4313 0.0264 10.9039 0.5511 0.6740 5.2687 1.5194 3.0592 9.2563 2.2941 0.4965 6.1478 2.2676 0.7180 15.1798 3.0561 6.6152 6.1612 4.5794 1.7528 14.2794 1.0865 1.0264 13.7972 8.0473 12.1832 31.1208 16.0248 6.8980 2.8520 1.4208 2.8609 6.6896 6.8548 2.7024 7.0111 17.6538 11.4269 18.4830 11.0173 10.2647 1.5630 4.5219 18.2694 13.3327 15.3711 8.2488 5.7902 163.1264 1.1484 16.3436 27.0180 10.3434 29.4577 33.0155 53.2257 13.4492 42.4119 48.9342 39.1925 11.9368 4.4616 62.4330 40.1227 61.8960 46.5425 48.5946
temp: 298.150 k
press: 1.00000 atm
elementType: 8 6 6 6 6 6 6 6 6 6 6 1 1 1 1 1 1 1 1 1 1 1 1 1 1 1 1 1 1
symmnumber: 1
zpe: 678550.6 jmol-1
zpe.correction: 0.258446 hartree
zpe.thermalcorrener: 0.270825 hartree
zpe.thermalcorrenthalpy: 0.271769 hartree
zpe.thermalcorrgfe: 0.219962 hartree
zpe.sumelectzpe: -466.197244 hartree
zpe.sumelectthermal: -466.184865 hartree
zpe.sumelectthermalent: -466.183921 hartree
zpe.sumelectthermalfe: -466.235728 hartree
dipole: -0.6931 -3.2652 -1.1397
dipole: 3.5272
quadrupole: -66.2362 -79.0723 -68.9375
quadrupole: -1.6713 -0.7787 -4.1382
quadrupole: 5.1791 -7.6570 2.4778 -1.6713 -0.7787 -4.1382
hfenergy: -466.4556901 hartree
pointgroup: C01 [X(C10H18O1)]
dipole: 0.2966621 -1.2616397 0.4959222 debye
polarizability: 118.268577|-0.9506567|108.1221168|1.7817797|-1.0145013|92.986046 unknown
InChI: InChI=1S/C10H18O/c1-7(2)9-5-4-8(3)6-10(9)11/h7-9H,4-6H2,1-3H3
charge 0 multiplicity 1
29 atoms
O  -0.270399 2.348586 -0.921683
C  -0.841621 -0.026857 -0.710744
C  0.116698 -1.137546 -1.241271
C  2.134417 -0.136081 -0.02362
C  1.298451 -1.414792 -0.282901
C  -1.683306 -0.448116 0.547235
C  1.214314 1.015469 0.485632
C  0.000411 1.222863 -0.420017
C  3.292999 -0.38805 0.964042
C  -2.608343 0.711211 0.992889
C  -2.522894 -1.717886 0.267919
H  -1.561395 0.245851 -1.50829
H  0.521497 -0.811531 -2.221128
H  -0.453702 -2.064387 -1.433793
H  2.566144 0.187151 -0.995003
H  0.925186 -1.809711 0.684371
H  1.950771 -2.200178 -0.712362
H  -0.989108 -0.677304 1.381844
H  1.769401 1.967377 0.557784
H  0.859064 0.751909 1.504344
H  2.904771 -0.71804 1.947117
H  3.974792 -1.173734 0.588395
H  3.889657 0.528686 1.126726
H  -3.327224 0.96355 0.190304
H  -3.186802 0.426072 1.890969
H  -2.042803 1.630866 1.226806
H  -3.16748 -1.574577 -0.620502
H  -3.18144 -1.937513 1.128796
H  -1.895554 -2.610288 0.094841
