program: Gaussian 09
title: 000042343
version: EM64L-G09RevD.01
frameworkgroup: C1[X(C14H18ClN3O4)]
method: RPBEPBE
basis: SDD
operation: Freq
keyword: #p
keyword: freq=noraman
keyword: PBEPBE/SDD
title: #p freq=noraman PBEPBE/SDD
converged: YES YES NO NO
title: Mulliken charges:
elementType: Cl O O O O N N N C C C C C C C C C C C C C C H H H H H H H H H H H H H H H H H H
charge: 0.010365 -0.214956 -0.222582 -0.215578 -0.201835 -0.199343 -0.103932 0.012788 0.008091 -0.472922 0.401345 -0.179493 0.153526 -0.744264 0.324995 -0.509921 -0.676217 -0.623641 -0.632963 -0.283402 0.423376 -0.445832 0.209845 0.278340 0.251734 0.271230 0.232686 0.229122 0.230056 0.318757 0.228544 0.251619 0.256058 0.207682 0.227903 0.217981 0.247738 0.225077 0.193359 0.314666
chargesum: 0.00000
title: Mulliken charges with hydrogens summed into heavy atoms:
elementType: Cl O O O O N N N C C C C C C C C C C C C C C
charge: 0.010365 -0.214956 -0.222582 -0.215578 -0.201835 -0.199343 -0.103932 0.012788 0.217936 0.057152 0.401345 0.091737 0.153526 -0.052400 0.324995 -0.191164 0.060004 0.029924 0.033211 -0.283402 0.423376 -0.131166
polarizability: 2.71445666e+02 4.91480879e+00 2.68934618e+02 6.86151549e+00 4.06634122e+00 1.15405128e+02
1716.lowfreq: -9.6076 -5.2755 -0.0020 -0.0013 -0.0011 6.8475 26.2734 32.8617 48.4748
frequency: 26.1339 32.8066 48.4346 59.2079 61.7949 79.1759 84.7473 112.9883 138.3322 154.6235 163.2453 188.6920 200.7506 214.3259 223.6945 232.9625 251.5358 272.0477 289.4865 309.4287 315.0040 339.4397 342.5520 356.8720 365.1241 395.4631 401.4315 432.6054 445.2850 473.9548 486.3240 514.7612 526.4131 554.2718 561.4947 590.2255 640.5847 696.0739 699.8592 706.5884 736.0184 743.9421 765.2440 799.8808 840.7230 864.1522 873.2321 892.4224 896.7520 909.2795 959.3115 968.4288 1010.9915 1031.8639 1039.5933 1057.9284 1073.1173 1080.8911 1101.0171 1105.2961 1109.5359 1130.0001 1149.8907 1188.6346 1208.2242 1209.2297 1218.6394 1248.8810 1264.6016 1276.9779 1296.9187 1306.4948 1320.6592 1345.0769 1353.2521 1355.3017 1369.0895 1385.0370 1388.9531 1412.1537 1422.7207 1436.6023 1447.5301 1460.5788 1463.0500 1465.2504 1466.1652 1466.9856 1471.0697 1475.1308 1483.1299 1486.1247 1495.3921 1574.0156 1598.1225 1618.8202 2830.5110 2865.6037 2877.9213 2995.7757 2996.4665 3032.2706 3037.4617 3042.9624 3084.1858 3089.4483 3092.0393 3097.6189 3105.0588 3106.8493 3109.7564 3112.2904 3195.8955 3211.6855
redmass: 5.3827 3.7412 3.1352 4.5488 6.8541 6.7099 4.1814 5.7783 6.3206 6.7260 14.4514 3.2410 4.1816 1.0491 1.2098 1.3159 2.8531 2.7276 1.3606 4.4771 6.7024 5.2503 6.0468 2.7216 3.8207 4.2644 4.3562 2.4831 3.6084 2.8075 3.8293 4.4463 4.9330 5.3071 5.2325 4.6505 6.6452 4.9796 6.3546 6.4146 7.0753 5.8463 3.7774 3.8615 3.7211 3.1422 2.9849 1.3798 2.1874 1.5112 2.2160 2.0967 2.7677 1.5879 2.7220 2.1725 1.6582 1.3072 2.2379 2.3669 2.8670 1.4551 2.2746 2.3476 1.8312 5.8843 2.7697 1.7882 2.4755 2.9956 1.4311 1.4005 1.4267 1.7699 2.0724 1.5570 3.9416 1.2227 1.2384 7.3311 1.1495 4.3295 1.1488 1.6552 1.5451 1.1444 1.0612 1.0517 1.1548 1.0536 1.0554 1.0494 1.0531 8.2150 9.1402 9.0188 1.0801 1.0567 1.0569 1.0359 1.0353 1.0738 1.0756 1.0601 1.0999 1.0958 1.0988 1.1010 1.0976 1.0980 1.1037 1.0950 1.0932 1.0912
irintensity: 0.1323 0.5343 1.3618 0.7763 0.4417 1.0457 0.5848 6.3637 2.8062 1.4788 0.8243 0.3970 0.2430 0.7268 0.6990 0.4182 2.2417 7.6884 0.1523 4.1388 1.9924 7.6778 0.5680 1.4918 1.2152 6.7853 5.5060 2.1150 3.2944 5.7652 1.2340 7.1086 2.1019 4.0118 8.4522 7.2466 23.9299 4.7072 16.8264 19.4441 8.7736 7.4182 10.4763 8.7894 28.6991 10.3769 2.5175 0.2734 4.5257 38.4317 22.3186 22.6420 72.8780 10.3573 22.3474 21.4587 18.2307 1.5499 28.4706 88.0657 16.4628 17.8941 1.8642 102.1705 2.5714 405.0571 12.4440 136.1125 34.5071 1.9034 11.7180 1.0442 24.5090 58.3074 104.8288 20.1259 69.8248 24.0558 46.2100 15.8134 5.6178 120.6222 3.5094 37.5995 124.7504 9.8201 17.7012 8.2868 41.6361 4.4801 39.2030 27.9360 11.1343 2.3278 180.2428 225.1060 110.6481 80.5203 130.0339 17.6993 6.2585 24.1905 43.6734 31.5682 40.5949 5.4572 53.6984 21.3942 20.1712 8.5663 6.2361 18.3762 13.9270 10.3841
temp: 298.150 k
press: 1.00000 atm
elementType: 17 8 8 8 8 7 7 7 6 6 6 6 6 6 6 6 6 6 6 6 6 6 1 1 1 1 1 1 1 1 1 1 1 1 1 1 1 1 1 1
symmnumber: 1
zpe: 813406.0 jmol-1
zpe.correction: 0.309810 hartree
zpe.thermalcorrener: 0.331826 hartree
zpe.thermalcorrenthalpy: 0.332770 hartree
zpe.thermalcorrgfe: 0.257956 hartree
zpe.sumelectzpe: -1467.743438 hartree
zpe.sumelectthermal: -1467.721423 hartree
zpe.sumelectthermalent: -1467.720478 hartree
zpe.sumelectthermalfe: -1467.795292 hartree
dipole: -1.8793 -2.7929 1.8441
dipole: 3.8383
quadrupole: -137.0505 -160.3810 -136.0127
quadrupole: -11.0592 -3.3451 -9.1404
quadrupole: 7.4309 -15.8996 8.4687 -11.0592 -3.3451 -9.1404
hfenergy: -1468.0532481 hartree
pointgroup: C01 [X(C14H18Cl1N3O4)]
dipole: -0.9693555 -0.8483235 0.7881052 debye
polarizability: 274.1391153|3.6981485|266.6245615|0.534531|-1.3470187|115.0217356 unknown
InChI: InChI=1S/C14H18ClN3O4/c1-8(16(3)4)7-17-12-6-10(18(20)21)5-11(15)13(12)22-9(2)14(17)19/h5-6,8-9H,7H2,1-4H3
charge 0 multiplicity 1
40 atoms
Cl 4.330161 -1.791427 -0.146697
O  1.49135 -2.646468 -0.394964
O  -2.108873 -2.970538 -0.713316
O  1.006232 3.690128 0.001513
O  3.273024 3.444264 0.122816
N  -0.836088 -1.012501 -0.487886
N  -3.567188 1.607476 -0.129437
N  2.078426 2.96393 0.020746
C  -2.688386 0.520303 0.392789
C  -2.006463 -0.159291 -0.839047
C  0.446899 -0.424868 -0.282157
C  0.184629 -3.226461 0.046586
C  -1.013774 -2.403352 -0.442414
C  -3.448088 -0.539596 1.214826
C  1.601993 -1.271743 -0.256404
C  0.621208 0.970089 -0.184361
C  0.171659 -3.398807 1.575382
C  -2.801881 2.810935 -0.532939
C  -4.710875 1.985529 0.730351
C  2.892222 -0.697985 -0.156053
C  1.923424 1.498546 -0.079366
C  3.07723 0.687747 -0.066079
H  -1.893695 0.953595 1.056224
H  -2.747023 -0.813727 -1.325895
H  -1.676645 0.591743 -1.575399
H  0.146134 -4.202427 -0.459728
H  -4.284274 -0.965079 0.632585
H  -2.767973 -1.370321 1.46957
H  -3.838011 -0.125937 2.160152
H  -0.216494 1.666621 -0.194904
H  0.213778 -2.425059 2.094957
H  -0.75234 -3.920195 1.879988
H  1.038479 -4.004435 1.888009
H  -2.259285 3.290616 0.319779
H  -3.492305 3.557564 -0.961593
H  -2.059667 2.573894 -1.314564
H  -5.36246 1.119114 0.920707
H  -5.313292 2.742068 0.196689
H  -4.409033 2.423254 1.714596
H  4.068565 1.137202 0.019137
