program: Orca
programVersion: 5.0.4
elementType: Ru Cl Cl Cl Cl S O N C C C C C C C H H C H H H H H H H H H H H
elementType: Ru
charge: -1
multiplicity: 2
keywords: UKS PBE0 def2-TZVPP TightSCF
formula: C8H13Cl4NORuS
InChI: InChI=1S/C6H7N.C2H6OS.4ClH.Ru/c1-6-2-4-7-5-3-6;1-4(2)3;;;;;/h2-5H,1H3;1-2H3;4*1H;/q-1;+1;;;;;+4/p-4
29 atoms
Ru -2.11254 -0.08032 0.01864
Cl -2.00795 -1.73726 -1.6416
Cl -1.9881 -1.74521 1.68094
Cl -2.14093 1.59492 1.68261
Cl -2.1410 1.56087 -1.67241
S  -4.40461 -0.14095 0.07353
O  -5.11606 -1.09645 -0.79828
N  -0.0000 0.0000 0.0000
C  0.73762 -1.11682 -0.00101
C  2.11609 -1.09645 -0.00136
C  2.79734 0.1183 -0.0000
C  2.01773 1.26868 0.0007
C  0.63957 1.17241 0.0000
C  -5.00602 -0.3978 1.72697
C  -5.1008 1.46635 -0.23043
H  0.18948 -2.0471 -0.00128
H  2.65508 -2.03586 -0.00225
C  4.28865 0.17346 0.00193
H  2.47607 2.24974 0.00179
H  0.01672 2.05476 0.00031
H  -4.70013 -1.39619 2.0286
H  -6.0911 -0.30624 1.69518
H  -4.55593 0.34599 2.38175
H  -4.8739 1.72563 -1.26123
H  -6.17508 1.39206 -0.06577
H  -4.63652 2.18112 0.44667
H  4.64981 1.20099 0.00373
H  4.69271 -0.33517 -0.87624
H  4.69063 -0.33743 0.87976
totalener: -2775.80579162 hartree
nucrepener: 2173.21530766 hartree
electener: -4949.02109928 hartree
oneelecener: -8215.85757254 hartree
twoeener: 3266.83647325 hartree
kineticenergy: 2709.86876462 hartree
exchangeener: -153.819012997280 hartree
correlationener: -6.557363583700 hartree
xcener: -160.376376580980 hartree
s2: 0.755181
chargesum: -1.0000000
charge: -0.007460 -0.385342 -0.436114 -0.448856 -0.431790 0.699424 -0.532029 0.046733 0.109624 -0.184180 0.053325 -0.153452 0.114260 -0.275255 -0.278363 0.102512 0.093931 -0.256681 0.089950 0.093787 0.130334 0.099077 0.120651 0.132020 0.100407 0.121275 0.082797 0.100055 0.099361
charge: -1.060222 -0.080600 -0.095927 -0.111723 -0.096267 0.922718 -0.338778 0.240793 -0.054309 -0.017846 -0.079776 -0.021093 -0.055757 -0.138554 -0.138920 0.016898 0.019163 0.015942 0.016839 0.016636 0.000241 -0.010912 0.000080 0.000967 -0.010705 0.001847 0.016506 0.021488 0.021269
qa: -0.0075 -0.3853 -0.4361 -0.4489 -0.4318 0.6994 -0.5320 0.0467 0.1096 -0.1842 0.0533 -0.1535 0.1143 -0.2753 -0.2784 0.1025 0.0939 -0.2567 0.0900 0.0938 0.1303 0.0991 0.1207 0.1320 0.1004 0.1213 0.0828 0.1001 0.0994
va: 5.7703 1.0376 0.9694 0.9610 0.9749 4.5033 1.9266 3.2768 3.9795 3.9783 3.7868 3.9635 3.9703 3.7992 3.8062 1.0414 1.0077 3.9145 1.0098 1.0488 1.0487 1.0188 1.0518 1.0454 1.0180 1.0506 1.0135 0.9998 0.9998
energy: -2775.805791624436
dipole: 37.59214 -35.72907 1.86307 7.53323 -6.49647 1.03676 5.93406 -4.98789 0.94618
magnitude: 2.33263 au
magnitude: 5.92907 debye
