program: Orca
programVersion: 5.0.4
elementType: Ru Cl Cl F N C C C C C H H C H H H H H N N H H H H H H
elementType: Ru
charge: 0
multiplicity: 2
keywords: UKS PBE0 def2-TZVPP TightSCF Opt
formula: C6H13Cl2FN3Ru
InChI: InChI=1S/C6H7N.2ClH.FH.2H3N.Ru/c1-6-2-4-7-5-3-6;;;;;;/h2-5H,1H3;3*1H;2*1H3;/q-1;;;;;;+4/p-3
26 atoms
Ru -0.010326 -0.008667 0.005361
Cl -0.050697 0.050228 2.346416
Cl -0.060627 -0.061019 -2.336249
F  -1.915067 -0.006059 0.00899
N  2.139322 -0.009976 0.000312
C  2.843086 -0.039123 -1.143316
C  4.222553 -0.029035 -1.181955
C  4.962205 0.014678 -0.007307
C  4.228072 0.049963 1.171561
C  2.848773 0.035299 1.140356
H  2.255702 -0.070161 -2.050776
H  4.713198 -0.052136 -2.147506
C  6.455489 0.000449 -0.009396
H  4.723312 0.093084 2.134122
H  2.265746 0.063569 2.050709
H  6.824658 -1.025587 0.074029
H  6.856444 0.419432 -0.932347
H  6.859217 0.561374 0.833909
N  -0.210694 -2.088992 0.059312
N  -0.201297 2.072996 -0.047418
H  0.172822 2.501787 -0.885635
H  -1.212587 2.182378 -0.056947
H  0.161548 2.540137 0.775161
H  -1.222499 -2.193195 0.073633
H  0.165634 -2.519498 0.895588
H  0.146072 -2.556804 -0.765476
totalener: -1515.41990541 hartree
nucrepener: 1258.64138645 hartree
electener: -2774.06129186 hartree
oneelecener: -4626.77959000 hartree
twoeener: 1852.71829814 hartree
kineticenergy: 1451.19202306 hartree
exchangeener: -97.375690886570 hartree
correlationener: -4.660161047152 hartree
xcener: -102.035851933722 hartree
s2: 0.753836
s2: 0.753878
s2: 0.753879
s2: 0.753876
s2: 0.753873
s2: 0.753870
s2: 0.753869
s2: 0.753946
s2: 0.753920
s2: 0.753877
s2: 0.753867
s2: 0.753860
s2: 0.753858
s2: 0.753857
s2: 0.753856
s2: 0.753855
s2: 0.753854
s2: 0.753853
s2: 0.753852
s2: 0.753912
s2: 0.753883
s2: 0.753840
s2: 0.753826
s2: 0.753824
s2: 0.753829
s2: 0.753831
s2: 0.753833
s2: 0.753834
s2: 0.753839
s2: 0.753845
s2: 0.753851
s2: 0.753850
s2: 0.753838
s2: 0.753837
s2: 0.753835
s2: 0.753828
s2: 0.753832
s2: 0.753830
s2: 0.753827
s2: 0.753823
s2: 0.753821
s2: 0.753890
s2: 0.753804
s2: 0.753797
s2: 0.753791
s2: 0.753787
s2: 0.753785
s2: 0.753784
s2: 0.753782
s2: 0.753781
s2: 0.753780
s2: 0.753779
s2: 0.753864
s2: 0.753776
s2: 0.753772
s2: 0.753771
s2: 0.753770
s2: 0.753769
s2: 0.753768
s2: 0.753767
s2: 0.753848
s2: 0.753810
s2: 0.753798
s2: 0.753793
s2: 0.753963
s2: 0.753937
s2: 0.754008
s2: 0.753974
s2: 0.753894
s2: 0.753868
s2: 0.753871
s2: 0.753881
s2: 0.753886
s2: 0.753892
s2: 0.753896
s2: 0.753898
s2: 0.753893
s2: 0.753889
s2: 0.753885
s2: 0.753884
s2: 0.753887
s2: 0.753891
s2: 0.754069
s2: 0.754028
s2: 0.753954
s2: 0.753929
s2: 0.753913
s2: 0.753915
s2: 0.753922
s2: 0.753931
s2: 0.753936
s2: 0.753940
s2: 0.753944
s2: 0.753947
s2: 0.753945
s2: 0.754140
s2: 0.754081
s2: 0.753968
s2: 0.753921
s2: 0.753906
s2: 0.753914
s2: 0.753928
s2: 0.753934
s2: 0.753939
s2: 0.754055
s2: 0.753994
s2: 0.753907
s2: 0.753919
s2: 0.753926
s2: 0.753930
s2: 0.753932
s2: 0.753927
s2: 0.753925
s2: 0.753923
s2: 0.753924
s2: 0.753995
s2: 0.753897
s2: 0.753909
s2: 0.753911
s2: 0.753910
s2: 0.753904
s2: 0.753900
s2: 0.753917
s2: 0.753822
s2: 0.753846
s2: 0.753863
s2: 0.753862
s2: 0.753814
s2: 0.753775
s2: 0.753766
s2: 0.753790
s2: 0.753783
s2: 0.753786
s2: 0.753789
s2: 0.753792
s2: 0.753795
s2: 0.753796
s2: 0.753895
s2: 0.753825
s2: 0.753820
s2: 0.753918
s2: 0.753861
s2: 0.753866
s2: 0.753865
chargesum: -0.0000000
charge: 0.289753 -0.415916 -0.416019 -0.455805 -0.038301 0.011713 -0.112807 0.031406 -0.116208 0.012057 0.119319 0.118321 -0.250204 0.118784 0.119289 0.113987 0.100204 0.101674 -0.237457 -0.237921 0.185002 0.202395 0.184669 0.202072 0.185175 0.184817
charge: -0.403079 -0.062406 -0.062696 -0.293988 0.220792 -0.062855 -0.007964 -0.069333 -0.007612 -0.062916 -0.010856 0.027906 0.028380 0.028162 -0.010687 0.029820 0.024107 0.024675 0.379382 0.379272 -0.019358 -0.005323 -0.019355 -0.005434 -0.019320 -0.019313
qa: 0.2898 -0.4159 -0.4160 -0.4558 -0.0383 0.0117 -0.1128 0.0314 -0.1162 0.0121 0.1193 0.1183 -0.2502 0.1188 0.1193 0.1140 0.1002 0.1017 -0.2375 -0.2379 0.1850 0.2024 0.1847 0.2021 0.1852 0.1848
va: 5.1441 1.0281 1.0278 0.8485 3.2694 3.9122 3.9253 3.7897 3.9271 3.9115 1.0762 1.0043 3.9188 1.0040 1.0761 0.9966 1.0075 1.0063 3.3636 3.3629 1.0096 1.0018 1.0102 1.0021 1.0093 1.0099
energy: -1515.422076845302
dipole: 90.68917 -87.74723 2.94194 0.28256 -0.29780 -0.01524 -0.21601 0.21369 -0.00232
magnitude: 2.94198 au
magnitude: 7.47792 debye
