program: Orca
programVersion: 5.0.3
elementType: Ru Cl Cl B N C C C C C H H C H H H H H N N H H H H H H H H
elementType: Ru
charge: 0
multiplicity: 2
keywords: UKS PBE0 def2-TZVPP TightSCF
formula: C6H15BCl2N3Ru
InChI: InChI=1S/C6H7N.BH2.2ClH.2H3N.Ru/c1-6-2-4-7-5-3-6;;;;;;/h2-5H,1H3;1H2;2*1H;2*1H3;/q;+1;;;;;+1/p-2
28 atoms
Ru -0.0000 0.0000 0.0000
Cl 0.10392 -2.33084 -0.04113
Cl 0.10412 2.33075 0.04227
B  -1.94469 0.00146 -0.00122
N  2.5650 -0.0000 0.00123
C  3.2577 -1.13795 0.0000
C  4.64118 -1.1821 -0.00033
C  5.37077 0.00106 0.00135
C  4.63996 1.18425 -0.00139
C  3.2572 1.13899 -0.0000
H  2.66382 -2.04641 -0.00433
H  5.14482 -2.14171 -0.00553
C  6.86537 0.00352 0.02761
H  5.14273 2.14435 -0.00757
H  2.66241 2.04687 -0.00161
H  7.27089 0.85092 -0.5262
H  7.27275 -0.91565 -0.3936
H  7.22835 0.08325 1.05603
N  -0.03115 -0.03933 2.10234
N  -0.02928 0.03924 -2.10227
H  0.33623 0.9253 -2.43191
H  -0.98967 -0.05416 -2.41884
H  0.51994 -0.71786 -2.49119
H  -0.99122 0.05864 2.41843
H  0.32972 -0.92743 2.43167
H  0.52148 0.71482 2.4921
H  -2.59552 -0.00205 -1.02791
H  -2.59728 0.00645 1.02434
totalener: -1441.59141165 hartree
nucrepener: 1179.92593033 hartree
electener: -2621.51734197 hartree
oneelecener: -4363.49132797 hartree
twoeener: 1741.97398600 hartree
kineticenergy: 1377.47683327 hartree
exchangeener: -93.209403258355 hartree
correlationener: -4.540628457567 hartree
xcener: -97.750031715923 hartree
s2: 0.758640
chargesum: -0.0000000
charge: 0.192926 -0.404590 -0.404418 0.009230 -0.177361 0.002006 -0.113757 0.025454 -0.119289 0.002168 0.110208 0.111910 -0.248316 0.112656 0.110292 0.099623 0.097180 0.111305 -0.238082 -0.238054 0.187498 0.189761 0.192850 0.189826 0.187389 0.192862 -0.090651 -0.090627
charge: -0.344018 -0.039456 -0.039096 -0.349187 0.205979 -0.088869 -0.013195 -0.071762 -0.012660 -0.089064 0.004067 0.023128 0.025774 0.023565 0.003990 0.023438 0.022569 0.028054 0.399977 0.400037 -0.013111 -0.008008 -0.013290 -0.007971 -0.013138 -0.013350 -0.022203 -0.022201
qa: 0.1929 -0.4046 -0.4044 0.0092 -0.1774 0.0020 -0.1138 0.0255 -0.1193 0.0022 0.1102 0.1119 -0.2483 0.1127 0.1103 0.0996 0.0972 0.1113 -0.2381 -0.2381 0.1875 0.1898 0.1929 0.1898 0.1874 0.1929 -0.0907 -0.0906
va: 5.4273 1.0615 1.0617 3.2967 3.0427 3.9821 3.9271 3.7916 3.9301 3.9810 1.0520 1.0051 3.9133 1.0047 1.0521 1.0066 1.0085 0.9972 3.3879 3.3880 1.0128 1.0132 1.0036 1.0130 1.0130 1.0035 0.9753 0.9753
energy: -1441.591411645122
dipole: 99.36235 -97.05928 2.30306 0.04553 -0.04154 0.00399 0.19142 -0.17086 0.02057
magnitude: 2.30316 au
magnitude: 5.85416 debye
