program: Gaussian 16
title: CH TS attempt 1 MeCN in Solvent
version: EM64L-G16RevC.01
frameworkgroup: C1[X(C17H21FN2O4Pd)]
method: RM06L
basis: def2SVP
operation: Freq
keyword: #P
keyword: Geom=AllCheck
keyword: Guess=TCheck
keyword: SCRF=Check
keyword: Test
keyword: GenChk
keyword: RM06L/def2SVP
keyword: Freq
converged: YES YES YES YES
title: Mulliken charges:
elementType: C C C C C C C O N O C H H C C C C H H C H H H H H H H Pd C O O C H H H H N C C H H H H H H F
charge: 0.104847 -0.331607 -0.006309 -0.127914 0.370396 -0.151315 0.373575 -0.364189 -0.301157 -0.326113 0.115238 0.052596 0.058129 -0.445645 0.073614 0.005485 -0.034700 0.035848 0.038023 -0.039924 0.054112 0.059272 0.043349 0.036415 0.049940 0.040721 0.351639 0.396359 0.302281 -0.395393 -0.433859 -0.093635 0.101357 0.093279 0.078544 0.067878 -0.065021 -0.122693 -0.039266 0.136387 0.136106 0.137002 0.073138 0.075745 0.061549 -0.244086
chargesum: -0.00000
title: Mulliken charges with hydrogens summed into heavy atoms:
elementType: C C C C C C C O N O C C C C C C Pd C O O C N C C F
charge: 0.104847 -0.331607 0.069436 -0.054776 0.370396 -0.089766 0.373575 -0.364189 -0.301157 -0.326113 0.293840 -0.445645 0.147486 0.118869 0.045065 0.050737 0.396359 0.302281 -0.043755 -0.433859 0.179544 -0.065021 -0.122693 0.370230 -0.244086
polarizability: 4.26007678e+02 7.70879304e-01 3.79970729e+02 2.18997957e+01 9.14509339e-01 2.92049931e+02
1716.lowfreq: -1587.1928 -0.0009 -0.0008 -0.0005 2.8732 9.8489 15.0871 28.7899 31.8802
frequency: -1587.1928 28.2606 31.8184 37.3631 42.7412 44.7851 52.3618 67.0374 70.3399 79.1049 91.0212 106.2294 115.9788 117.4003 139.5845 148.6212 168.9726 174.8481 197.6441 206.0138 210.7482 218.5938 232.9679 237.8678 248.5859 272.5768 286.1306 305.0378 317.0901 328.0274 353.9501 378.6097 398.9966 420.2557 431.5484 443.0062 481.1923 504.3422 515.1520 540.5070 577.7572 593.1179 611.8221 630.0917 662.9665 668.5200 701.5309 730.3196 762.1295 780.4457 814.7640 823.5256 852.2717 878.5422 895.0248 921.0446 940.2583 964.5835 974.7815 983.8835 993.6509 996.6596 1012.9928 1014.3131 1015.2272 1022.3933 1025.8092 1034.6225 1039.6446 1045.8286 1066.0528 1078.9014 1097.0723 1128.4137 1154.7587 1159.1469 1178.0125 1197.3247 1213.6939 1215.8842 1230.5870 1248.3865 1267.4615 1289.3542 1294.3445 1316.9332 1327.8903 1338.9247 1341.2361 1349.4106 1358.0934 1369.7401 1385.7539 1387.9644 1399.2205 1416.1111 1417.9443 1423.8396 1429.2710 1430.8551 1433.9277 1434.5850 1450.5960 1455.6705 1457.7828 1494.4670 1510.8018 1623.1545 1647.5065 1659.4690 1740.7512 2395.0475 2978.0485 3035.7500 3050.2586 3053.0366 3062.1897 3063.4601 3064.9846 3080.4304 3111.8789 3118.2520 3128.5120 3138.7555 3160.7104 3169.1257 3178.0216 3192.2469 3193.2992 3210.3963 3211.7170 3211.8223
redmass: 1.0998 4.6231 4.5128 3.2774 2.9660 1.1055 1.6985 2.4081 4.1686 4.4549 3.7642 4.6419 3.3907 2.3633 6.5044 5.4082 4.0413 5.1051 4.4348 3.5840 2.1076 4.3654 4.4528 5.1147 2.9474 5.6274 5.6457 7.9443 6.1090 2.7725 5.2796 5.1209 7.8259 3.9012 4.4271 5.2691 3.4275 4.8752 3.6821 4.5873 2.5253 6.0618 3.1609 2.7433 4.0220 5.2253 5.2134 4.5486 1.7435 2.7629 2.3285 1.4055 3.2898 1.6825 4.4846 2.3751 2.4333 2.3728 1.6543 2.6513 3.1159 3.1714 1.5186 2.3235 1.5063 1.8128 2.5613 2.4242 1.9533 1.8095 4.9228 1.6225 1.4405 1.3688 2.2660 1.3163 1.6771 1.6078 1.4388 1.7775 1.5112 1.6896 1.5171 2.3923 1.3078 1.5979 2.3102 1.6503 1.3786 1.7769 1.3432 2.7590 1.0342 1.0342 1.1558 1.0422 1.0721 1.0953 1.1619 2.3647 1.0883 1.1969 1.1301 1.0741 2.8799 3.2046 3.5985 7.7613 6.6785 7.2287 12.4823 12.6098 1.0348 1.0643 1.0644 1.0650 1.0370 1.0389 1.0675 1.1055 1.1027 1.1047 1.1043 1.1039 1.1035 1.0901 1.1023 1.1051 1.1052 1.0929 1.1072 1.0962
irintensity: 7011.7633 3.0312 2.7974 3.4102 2.8471 0.6539 5.7152 1.6856 3.9433 4.9542 1.0042 1.6775 1.0650 2.0536 4.1461 1.5537 1.6916 3.2586 8.5403 0.1614 5.5227 0.1965 9.4682 6.1292 8.4014 7.8518 47.2077 42.8189 4.5001 3.7048 4.4103 15.5344 13.7604 1.4549 0.4326 5.3279 8.8117 14.0505 6.6251 7.6182 9.9796 7.5363 11.8356 15.9039 4.9077 5.6557 74.3715 19.5294 1.6594 33.0631 11.7859 72.9853 24.2572 46.5139 12.2430 31.9272 24.9147 64.8955 2.7768 49.0280 7.7917 40.3686 17.3565 15.4087 15.9991 7.3654 2.3338 85.0894 10.4339 34.8558 246.3933 12.5645 112.7283 353.8939 28.8599 16.0696 64.2532 23.5280 29.1760 93.9885 10.2450 17.4059 32.7155 65.1011 3.4394 38.0967 131.4953 60.2993 9.2334 0.4181 2.6276 5.5085 24.5202 24.5535 81.4311 8.8540 21.9847 7.4696 3.1935 0.0744 8.7253 11.3720 9.9562 44.6606 143.7445 131.5467 174.5255 114.5029 276.7115 722.2375 759.9041 52.6225 110.0422 40.2142 58.8812 68.0196 0.2361 15.3705 97.2248 63.9702 28.0829 28.7409 28.9023 54.4221 27.4151 10.3277 1.9985 6.7096 6.4203 10.0190 7.6559 3.7565
temp: 298.150 k
press: 1.00000 atm
elementType: 6 6 6 6 6 6 6 8 7 8 6 1 1 6 6 6 6 1 1 6 1 1 1 1 1 1 1 46 6 8 8 6 1 1 1 1 7 6 6 1 1 1 1 1 1 9
symmnumber: 1
zpe: 928559.8 jmol-1
zpe.correction: 0.353670 hartree
zpe.thermalcorrener: 0.380515 hartree
zpe.thermalcorrenthalpy: 0.381459 hartree
zpe.thermalcorrgfe: 0.294402 hartree
zpe.sumelectzpe: -1297.319746 hartree
zpe.sumelectthermal: -1297.292901 hartree
zpe.sumelectthermalent: -1297.291957 hartree
zpe.sumelectthermalfe: -1297.379014 hartree
dipole: 10.3981 3.5279 -0.5628
dipole: 10.9947
quadrupole: -112.9701 -164.6036 -151.6203
quadrupole: -15.7959 -7.9734 2.0199
quadrupole: 30.0946 -21.5389 -8.5556 -15.7959 -7.9734 2.0199
hfenergy: -1297.6734158 hartree
pointgroup: C01 [X(C17H21F1N2O4Pd1)]
dipole: -3.4023169 -2.6520139 -0.3196045 debye
polarizability: 424.0445993|14.419812|382.2955374|-6.7262327|-16.7849471|291.6882013 unknown
InChI: InChI=1S/C15H18FNO4.C2H3N.Pd/c1-10(18)21-22-13-6-5-11(16)9-12(13)15(7-3-4-8-15)14(19)17-20-2;1-2-3;/h5-6,9H,3-4,7-8H2,1-2H3;1H3;/q-2;;+2
charge 0 multiplicity 1
46 atoms
C  1.74199889 0.56015139 0.1740926
C  0.97191238 -0.63166697 0.09080988
C  1.51350732 -1.74994821 -0.58502997
C  2.78595952 -1.7291384 -1.13745578
C  3.51731413 -0.55124505 -1.01639191
C  3.02577634 0.58157349 -0.37862967
C  0.13818344 2.39818481 -0.27211992
O  0.1267742 3.59703256 -0.53897273
N  -0.67657531 1.46982967 -0.8314825
O  -1.66340249 2.01733127 -1.65192073
C  -1.56928861 1.47433351 -2.94632051
H  -1.68103104 0.37397802 -2.93488936
H  -0.61100923 1.72670188 -3.43224325
C  1.13792086 1.80854199 0.76212881
C  2.1539925 2.8928063 1.14741104
C  0.40297809 1.59871789 2.10731844
C  1.45817343 3.7873434 2.18142953
H  2.51575721 3.44995371 0.27258215
H  3.0264549 2.39719561 1.60139419
C  0.21249591 3.01205383 2.63874442
H  1.06198667 1.01310002 2.77119577
H  -0.53958735 1.03775283 2.01443
H  2.13155728 4.00373572 3.02438384
H  1.18122053 4.75847568 1.74867621
H  0.06495306 3.03070523 3.72826987
H  -0.69571818 3.45179699 2.19719441
H  0.42942735 -1.09371926 1.22090999
Pd -1.09251296 -0.3973619 -0.14729132
C  -0.89220077 -2.59631173 1.736319
O  0.05810592 -1.90161872 2.2090534
O  -1.50888257 -2.30812482 0.67214949
C  -1.2814139 -3.83576079 2.47578522
H  -0.46127112 -4.56371187 2.40955486
H  -1.42040999 -3.6102826 3.54032082
H  -2.19243176 -4.28370109 2.06768594
H  -2.39382295 1.90541051 -3.5288272
N  -3.14175577 -0.22177531 -0.57139707
C  -4.26694923 -0.13689248 -0.83530344
C  -5.65768932 -0.02309758 -1.16610583
H  -5.830419 -0.38035493 -2.18905564
H  -6.26110454 -0.62314464 -0.47377358
H  -5.97420668 1.02523027 -1.09788227
H  3.21771935 -2.59180233 -1.64732753
H  0.92644834 -2.67176513 -0.646163
H  3.65390206 1.47323628 -0.34757962
F  4.74772185 -0.50209757 -1.54069138
