program: Gaussian 16
title: CH TS attempt 1 MeCN in Solvent
version: EM64L-G16RevC.01
frameworkgroup: C1[X(C18H21N3O4Pd)]
method: RM06L
basis: def2SVP
operation: Freq
keyword: #P
keyword: Geom=AllCheck
keyword: Guess=TCheck
keyword: SCRF=Check
keyword: Test
keyword: GenChk
keyword: RM06L/def2SVPFreq
converged: YES YES NO YES
title: Mulliken charges:
elementType: C C C C C C C O N O C H H C C C C H H C H H H H H H H Pd C O O C H H H H N C C H H H H H H C N
charge: 0.114207 -0.310107 -0.001406 0.012037 -0.178158 -0.024502 0.381750 -0.358211 -0.300815 -0.323191 0.114274 0.054865 0.060467 -0.448067 0.066320 0.002253 -0.031668 0.039227 0.041242 -0.038016 0.056637 0.061867 0.044169 0.037290 0.051079 0.041454 0.346460 0.407719 0.302529 -0.397537 -0.434291 -0.091740 0.104815 0.091466 0.080568 0.069271 -0.065610 -0.116799 -0.037640 0.137590 0.138007 0.136305 0.070086 0.076572 0.062488 0.063428 -0.108685
chargesum: -0.00000
title: Mulliken charges with hydrogens summed into heavy atoms:
elementType: C C C C C C C O N O C C C C C C Pd C O O C N C C C N
charge: 0.114207 0.036353 0.075166 0.082123 -0.178158 0.037986 0.381750 -0.358211 -0.300815 -0.323191 0.298877 -0.448067 0.146789 0.120757 0.049790 0.054516 0.407719 0.302529 -0.397537 -0.434291 0.185110 -0.065610 -0.116799 0.374262 0.063428 -0.108685
polarizability: 4.97011444e+02 -3.88081756e+00 4.00557794e+02 3.33420115e+01 7.02825528e+00 3.08929238e+02
1716.lowfreq: -1605.8639 0.0006 0.0007 0.0008 6.3914 9.7785 13.1039 25.1291 31.5030
frequency: -1605.8639 24.9969 31.4911 38.6925 41.5059 58.9008 59.9998 69.8104 71.0187 78.7141 86.7601 103.5964 109.1637 115.9387 123.2302 136.3656 154.1372 166.6367 169.9528 190.9683 204.6273 207.3116 213.5227 218.5363 235.5899 253.2415 268.7106 290.6399 296.6729 313.3692 334.5260 335.4478 387.6603 401.9886 418.7503 431.8576 443.9446 464.3549 501.8939 514.1322 525.0279 555.2050 580.8908 602.4681 621.3393 626.9200 671.7929 676.3814 704.1209 728.8246 760.5503 778.1236 807.6211 834.4029 840.7255 881.5772 912.5282 919.1602 941.8396 970.3994 984.0715 988.8008 995.2835 998.5339 1012.3427 1015.2603 1015.7992 1022.2561 1026.5429 1036.3413 1039.0715 1045.8510 1064.3477 1084.4939 1116.6252 1130.7008 1157.2912 1162.2570 1186.6142 1196.9990 1215.9816 1230.0161 1231.5845 1254.9978 1266.8279 1287.1298 1302.7496 1321.0835 1328.5257 1338.5785 1340.6699 1351.6467 1358.8389 1369.7811 1385.5459 1388.2113 1396.5444 1414.3545 1416.8327 1419.8666 1422.7690 1428.5881 1430.8600 1433.1544 1442.3207 1448.8650 1454.2726 1493.9962 1503.4416 1594.3781 1645.1914 1652.8386 1740.6413 2329.4824 2397.7536 2981.8861 3038.4846 3052.3257 3054.2215 3062.6376 3063.6820 3066.3607 3085.6134 3115.9219 3121.6569 3129.6091 3139.5418 3163.1408 3171.6705 3179.6209 3192.4981 3194.8351 3205.3746 3207.6781 3212.3596
redmass: 1.0995 4.7395 4.7354 4.6192 4.7820 1.5159 1.2331 3.7656 1.8479 3.4410 3.4754 4.9632 2.6960 3.5216 4.6369 5.9425 6.4409 4.9311 4.3203 4.0021 1.7026 4.5416 4.2131 5.3641 3.8102 3.7872 5.5459 5.5979 7.4579 3.3886 3.9209 4.9342 6.0453 6.9482 3.9804 4.4026 4.7122 5.6112 5.1526 3.5962 5.1453 5.5785 2.4068 6.4685 3.3251 2.7077 4.0893 6.8248 5.0831 4.4592 1.6526 2.9276 2.8478 2.5467 1.4423 3.9306 1.8084 2.1886 2.5509 3.5346 2.9675 1.4321 3.2953 2.7414 1.5024 1.5098 2.5864 1.6638 2.8062 2.1419 2.4118 1.9948 4.6857 1.6349 1.6660 1.7245 1.3109 1.6261 1.6602 1.5975 1.7477 1.5330 1.4555 1.6205 1.4621 2.1048 1.3381 1.5594 2.1777 1.4286 1.5463 2.0990 1.3438 1.9360 1.0342 1.0340 1.1387 1.6236 1.0395 1.5322 1.1247 1.1168 1.1073 1.0917 2.6691 1.1296 1.0733 2.8553 4.3873 6.7841 6.1900 7.2706 12.5256 12.6622 12.6159 1.0344 1.0649 1.0642 1.0648 1.0368 1.0389 1.0675 1.1059 1.1029 1.1036 1.1043 1.1041 1.1038 1.0903 1.1021 1.1050 1.1053 1.0926 1.0962 1.1080
irintensity: 6834.6204 3.0346 2.2859 1.9866 6.0186 3.1133 1.5649 2.6834 1.8942 5.9543 0.9054 6.0369 0.7284 1.8013 1.0649 6.6434 3.2064 8.7486 4.3878 2.7254 3.4606 5.8124 3.1490 4.4618 7.1743 10.5449 18.3231 37.1739 28.4457 11.7607 6.8884 5.9283 15.4234 5.8720 2.7530 1.8875 10.1261 6.5310 7.6042 8.8048 2.0788 20.9625 14.1834 2.9677 16.1801 15.3060 10.7911 2.5894 63.8197 19.7263 0.5851 51.5952 2.1287 24.9215 32.0502 31.7853 9.6945 27.3709 10.3521 46.1900 43.1154 11.2366 6.1491 38.6599 16.4549 17.2683 19.7268 3.5314 7.2925 29.2609 12.3061 36.9979 247.0566 42.8014 125.3945 374.9622 8.9944 108.2576 13.1609 16.4477 3.7706 17.3111 4.7827 22.3215 32.8888 40.5590 0.0918 24.1156 139.4714 21.3813 17.5230 15.6388 2.7001 6.5408 24.7809 24.8595 78.4792 2.3250 10.3679 59.5661 7.9243 4.4013 8.8785 10.9581 75.3100 10.6180 46.7561 47.0536 206.9477 37.8763 26.8101 677.7693 754.7913 253.5387 65.6484 108.8361 40.0345 53.7130 70.6680 0.5729 14.6543 95.2539 59.0312 26.4550 27.7672 28.5510 52.2925 25.7250 7.4069 3.9685 7.2796 6.9858 2.4883 7.4978 6.2704
temp: 298.150 k
press: 1.00000 atm
elementType: 6 6 6 6 6 6 6 8 7 8 6 1 1 6 6 6 6 1 1 6 1 1 1 1 1 1 1 46 6 8 8 6 1 1 1 1 7 6 6 1 1 1 1 1 1 6 7
symmnumber: 1
zpe: 946637.8 jmol-1
zpe.correction: 0.360555 hartree
zpe.thermalcorrener: 0.388330 hartree
zpe.thermalcorrenthalpy: 0.389274 hartree
zpe.thermalcorrgfe: 0.300364 hartree
zpe.sumelectzpe: -1290.330876 hartree
zpe.sumelectthermal: -1290.303102 hartree
zpe.sumelectthermalent: -1290.302158 hartree
zpe.sumelectthermalfe: -1290.391068 hartree
dipole: 14.3476 3.7515 0.3408
dipole: 14.8338
quadrupole: -147.5700 -173.6644 -159.8340
quadrupole: 1.2124 -27.0634 4.7253
quadrupole: 12.7861 -13.3083 0.5222 1.2124 -27.0634 4.7253
hfenergy: -1290.6914318 hartree
pointgroup: C01 [X(C18H21N3O4Pd1)]
dipole: 5.7473545 0.7735048 0.6553063 debye
polarizability: 486.3145118|-14.0058146|403.0508252|51.6142075|-2.3356906|317.1331381 unknown
InChI: InChI=1S/C14H15N2O2.C2H3N.C2H3O2.Pd/c1-18-16-13(17)14(7-2-3-8-14)12-6-4-5-11(9-12)10-15;1-2-3;1-2(3)4;/h4-6,9H,2-3,7-8H2,1H3;1H3;1H3;/q-1;;-1;+2
charge 0 multiplicity 1
47 atoms
C  -1.91036987 0.29842357 -0.08686902
C  -0.7900055 1.16453583 -0.17019136
C  -0.86530399 2.32632981 -0.96873339
C  -2.01707261 2.65514548 -1.66463851
C  -3.12864385 1.79922312 -1.56832115
C  -3.07160066 0.63292925 -0.78722303
C  -0.95716605 -1.99100704 -0.18425874
O  -1.30535321 -3.15684535 -0.34482021
N  0.15876964 -1.43518827 -0.72299864
O  0.98565568 -2.35751133 -1.36007858
C  1.19766003 -1.97318904 -2.69801406
H  1.65927534 -0.97074078 -2.76428764
H  0.26011695 -1.97072597 -3.27969155
C  -1.80699544 -1.00453211 0.66254969
C  -3.15513852 -1.66291177 0.98970736
C  -1.18318111 -0.89186259 2.07540655
C  -2.89622024 -2.61490848 2.16378879
H  -3.59297021 -2.16657013 0.1172414
H  -3.85638542 -0.87002295 1.29377932
C  -1.52122651 -2.22464341 2.72766981
H  -1.67759205 -0.05751241 2.60176427
H  -0.10431736 -0.67401927 2.07068551
H  -3.68708256 -2.51978668 2.92280737
H  -2.90435639 -3.66344694 1.83632117
H  -1.50257211 -2.16526056 3.82543511
H  -0.76505717 -2.97447582 2.44701747
H  -0.18869021 1.49308106 0.96409327
Pd 1.10641705 0.26125195 -0.12122211
C  1.47673022 2.58571244 1.55678723
O  0.31571828 2.27416048 1.95589547
O  2.06554251 2.00733286 0.59821543
C  2.17204 3.71985972 2.23833537
H  1.70788347 4.66172596 1.91402177
H  2.03743535 3.65288319 3.32427738
H  3.23752983 3.74937413 1.99081249
H  1.88913971 -2.70845943 -3.12929474
N  3.00088624 -0.5981824 -0.31358318
C  4.05103123 -1.06170331 -0.47005735
C  5.34577718 -1.6431016 -0.67116082
H  6.01633706 -0.91327613 -1.14145911
H  5.77382462 -1.95035565 0.29122304
H  5.26337092 -2.52323093 -1.32128681
H  -2.0709158 3.55846844 -2.27414615
H  -0.0034767 2.99836246 -1.01836455
H  -3.94744444 -0.01690261 -0.75546429
C  -4.32746704 2.11294489 -2.27525199
N  -5.30640339 2.37087432 -2.85394911
