program: Gaussian 16
title: CH TS attempt 1 MeCN in Solvent
version: EM64L-G16RevC.01
frameworkgroup: C1[X(C18H24N2O4Pd)]
method: RM06L
basis: def2SVP
operation: Freq
keyword: #P
keyword: Geom=AllCheck
keyword: Guess=TCheck
keyword: SCRF=Check
keyword: Test
keyword: GenChk
keyword: RM06L/def2SVPFreq
converged: YES YES YES YES
title: Mulliken charges:
elementType: C C C C C C C O N O C H H C C C C H H C H H H H H H H Pd C O O C H H H H N C C H H H H H H C H H H
charge: 0.099952 -0.320388 -0.026821 -0.109220 -0.032545 -0.087767 0.371708 -0.367129 -0.302385 -0.326670 0.115634 0.052297 0.057131 -0.436848 0.073955 0.003271 -0.036878 0.033780 0.035493 -0.039373 0.051347 0.057539 0.042173 0.035391 0.048828 0.039599 0.347732 0.389900 0.301050 -0.396058 -0.434225 -0.092980 0.091641 0.078516 0.101997 0.067105 -0.064824 -0.123208 -0.039096 0.136324 0.136293 0.136326 0.044319 0.047751 0.050834 -0.022574 0.074021 0.077238 0.059844
chargesum: -0.00000
title: Mulliken charges with hydrogens summed into heavy atoms:
elementType: C C C C C C C O N O C C C C C C Pd C O O C N C C C
charge: 0.099952 0.027344 0.017498 -0.109220 0.018289 -0.040016 0.371708 -0.367129 -0.302385 -0.326670 0.292167 -0.436848 0.143228 0.112156 0.040686 0.049053 0.389900 0.301050 -0.396058 -0.434225 0.179174 -0.064824 -0.123208 0.369847 0.188530
chargesum: 0.00000
polarizability: 4.41440233e+02 -5.24104439e+00 4.08090889e+02 2.95468476e+01 3.53181006e+00 3.12659696e+02
1716.lowfreq: -1600.1177 -5.1125 -0.0004 0.0005 0.0008 3.1085 12.8272 25.4871 32.2430
frequency: -1600.1177 25.1062 32.1151 35.8979 43.1528 46.7958 53.3608 64.2352 72.0905 75.7363 84.6660 93.4033 99.0323 106.4196 129.8564 137.1260 148.3084 160.2937 173.9922 199.8581 203.5497 205.1554 210.6035 222.3272 242.1226 248.6742 274.0556 288.5541 303.1226 310.4921 326.0142 336.1255 367.3433 397.4238 414.9110 422.3962 431.5311 468.4329 503.2969 512.7082 535.9041 559.3426 578.5461 598.1580 626.4013 644.6140 674.1628 704.8545 728.5389 765.6586 784.0762 813.5018 843.1504 849.2511 876.3907 904.3889 915.3694 935.6718 967.8442 973.0066 984.9847 991.5693 993.8952 996.6372 1000.4247 1013.4609 1014.8412 1020.2270 1023.4426 1038.5277 1042.7022 1044.2310 1048.3773 1065.1308 1080.5607 1119.9036 1128.4224 1155.8907 1167.9415 1194.0270 1201.5084 1222.8973 1231.0418 1242.9992 1255.2457 1266.2974 1281.8496 1297.8688 1320.2445 1333.4423 1339.5116 1342.4202 1354.7271 1357.9827 1365.1147 1375.7067 1385.1634 1386.4059 1387.6912 1398.9911 1414.1008 1417.5544 1422.9064 1426.1022 1428.7577 1430.3518 1434.2576 1435.3031 1447.0154 1450.6996 1453.0352 1505.6210 1524.3231 1603.4775 1655.5351 1660.4542 1737.9679 2394.9074 2977.9196 3035.2692 3037.7862 3049.7876 3052.7454 3061.8024 3063.6038 3064.6853 3079.7939 3113.3424 3118.7108 3127.2193 3137.2249 3137.6463 3146.2762 3158.4318 3163.7718 3167.9790 3178.4967 3191.7212 3191.8102 3193.0780 3211.6817
redmass: 1.0986 4.8574 4.1517 4.0089 3.2457 1.0255 1.5603 2.0695 1.9908 1.4876 3.8913 3.9187 4.0553 3.5025 2.1681 6.6020 3.9499 3.5599 4.1671 4.2338 4.2985 2.1219 3.4748 4.1733 3.0491 3.8218 5.4429 5.4873 3.8929 4.9261 4.2099 3.1541 3.7707 7.0827 4.0620 4.2199 4.3474 3.7643 4.6194 3.5207 3.4265 4.0903 2.6737 3.4915 2.6270 3.0785 6.4178 5.4372 4.9536 1.5363 2.9404 2.0152 1.8030 2.8974 3.8668 1.2817 2.6613 2.9728 3.7093 2.7047 1.4870 1.8615 3.2277 1.5607 5.0297 1.5086 1.5117 2.1143 1.4939 1.9095 1.6401 1.7024 2.3515 5.0127 1.6493 1.3043 2.1739 1.3177 1.6419 1.6738 1.6871 1.3366 1.5071 2.1004 1.7511 1.5155 1.7056 1.3090 1.5278 2.0206 1.5018 1.9242 1.6659 1.3496 1.9179 2.0534 1.6742 1.0343 1.0343 1.1289 1.0463 1.0835 1.0934 1.0416 1.1143 1.1080 1.2580 1.1437 1.9500 1.1283 1.0689 4.4330 3.1616 6.1375 7.1010 6.5465 12.4830 12.6105 1.0345 1.0651 1.0404 1.0641 1.0647 1.0370 1.0390 1.0673 1.1056 1.1026 1.1036 1.1044 1.1022 1.1040 1.0908 1.1035 1.0899 1.1045 1.1020 1.1051 1.0936 1.1051 1.1079
irintensity: 6797.2478 1.3716 4.1284 7.7181 1.2612 0.1290 5.7936 2.3074 1.8994 2.3074 0.5556 0.0242 6.4782 0.6023 1.5793 2.3049 3.2974 1.6498 1.4602 7.4355 0.0758 1.3031 5.7571 13.4954 5.4176 1.6393 15.0006 56.7659 18.4304 10.2939 5.2966 2.2710 8.7899 21.8781 1.0747 3.3166 0.6524 12.5099 6.6259 9.4517 15.2698 5.1739 8.3652 7.4536 8.7928 14.6862 20.2618 61.8988 11.1225 5.2006 32.0911 7.1384 28.2800 2.3713 12.7121 34.9051 43.1628 14.3997 60.5736 12.0571 3.9073 4.5351 8.5916 16.8567 62.4652 16.9533 16.4868 14.1808 1.5637 41.3005 29.0120 18.9643 106.6299 238.8644 25.6559 372.7986 18.9351 12.7973 30.8518 20.3376 3.6346 9.5530 1.2941 3.0696 13.3178 30.6728 35.0540 0.1298 1.8294 67.2810 42.1955 42.8613 42.0681 3.4122 21.7736 14.3622 12.5167 24.6646 24.9300 80.9347 8.0026 25.6180 8.1917 13.9842 4.8584 5.2581 0.5865 9.0969 55.9008 13.3757 43.8758 242.0983 89.0294 2.0554 397.4870 326.0726 774.2418 52.1294 112.0807 40.8391 64.8886 56.2181 75.6030 0.1826 16.3059 99.0837 62.7018 26.0711 28.4470 32.9848 10.7403 58.2082 23.7465 28.4272 23.2934 15.5046 2.7963 6.3590 25.3829 6.3343 7.2090
temp: 298.150 k
press: 1.00000 atm
elementType: 6 6 6 6 6 6 6 8 7 8 6 1 1 6 6 6 6 1 1 6 1 1 1 1 1 1 1 46 6 8 8 6 1 1 1 1 7 6 6 1 1 1 1 1 1 6 1 1 1
symmnumber: 1
zpe: 1021159.8 jmol-1
zpe.correction: 0.388939 hartree
zpe.thermalcorrener: 0.416809 hartree
zpe.thermalcorrenthalpy: 0.417754 hartree
zpe.thermalcorrgfe: 0.328342 hartree
zpe.sumelectzpe: -1237.418011 hartree
zpe.sumelectthermal: -1237.390141 hartree
zpe.sumelectthermalent: -1237.389197 hartree
zpe.sumelectthermalfe: -1237.478609 hartree
dipole: 8.7976 4.7045 -0.8626
dipole: 10.0137
quadrupole: -106.9402 -165.0076 -151.7527
quadrupole: -22.1788 -1.4213 -3.8435
quadrupole: 34.2933 -23.7741 -10.5192 -22.1788 -1.4213 -3.8435
hfenergy: -1237.8069505 hartree
pointgroup: C01 [X(C18H24N2O4Pd1)]
dipole: 3.5474179 1.6935271 -0.2624021 debye
polarizability: 440.1839615|-7.4647347|408.5181567|30.9842599|4.122666|313.4886997 unknown
InChI: InChI=1S/C16H21NO4.C2H3N.Pd/c1-11-6-7-13(14(10-11)22-21-12(2)18)16(8-4-5-9-16)15(19)17-20-3;1-2-3;/h6-7,10H,4-5,8-9H2,1-3H3;1H3;/q-2;;+2
charge 0 multiplicity 1
49 atoms
C  -1.97189424 0.32989872 -0.16053967
C  -0.81620017 1.14830283 -0.11210376
C  -0.81136787 2.38560203 -0.79520267
C  -1.91960401 2.85553149 -1.49996076
C  -3.05910647 2.03385526 -1.51840142
C  -3.08549242 0.80335017 -0.86677362
C  -1.10746757 -1.97959709 -0.4670253
O  -1.49976771 -3.10099688 -0.78094744
N  0.06440581 -1.42851336 -0.87010688
O  0.88516976 -2.31266727 -1.57204734
C  1.15287093 -1.80547753 -2.85638149
H  1.64809973 -0.81759168 -2.80858925
H  0.2359647 -1.71164264 -3.46369337
C  -1.9528614 -1.04990988 0.44596663
C  -3.33821468 -1.68025302 0.65002654
C  -1.38638255 -1.11639172 1.88495716
C  -3.16658615 -2.76251044 1.72336824
H  -3.75833858 -2.06968405 -0.28732946
H  -4.02079363 -0.89472781 1.01057054
C  -1.79933863 -2.49705578 2.37378474
H  -1.87300859 -0.32571955 2.48179572
H  -0.30131578 -0.94044374 1.94373788
H  -3.98159458 -2.71237552 2.46117574
H  -3.20612096 -3.76952086 1.28567787
H  -1.82036094 -2.56194736 3.47139503
H  -1.06320644 -3.24312017 2.03497738
H  -0.28172528 1.36918176 1.09215116
Pd 1.03591198 0.17296572 -0.08174623
C  1.40361745 2.30621055 1.84051924
O  0.21664195 1.99775438 2.16289717
O  2.00981001 1.81189126 0.84836813
C  2.10689743 3.33124071 2.67089505
H  1.97658726 3.109324 3.73702592
H  3.17216597 3.39012431 2.42782498
H  1.64488211 4.31174099 2.49031033
H  1.83444026 -2.51714351 -3.34035441
N  2.9194094 -0.74486138 -0.25269036
C  3.95877885 -1.243127 -0.3725483
C  5.24059066 -1.86824674 -0.52331873
H  5.80826527 -1.3746777 -1.3219252
H  5.80818034 -1.79490747 0.41271246
H  5.1128642 -2.92726983 -0.7803723
H  0.08504587 3.01433665 -0.74222784
H  -3.99041116 0.19478091 -0.93140911
H  -3.94684552 2.3667969 -2.06517474
C  -1.91045544 4.17513568 -2.20226409
H  -2.18386784 4.07052534 -3.26265813
H  -2.64199865 4.87096407 -1.76398388
H  -0.92539569 4.65645336 -2.15465093
