program: Gaussian 09
title: 000006982
version: EM64L-G09RevD.01
frameworkgroup: C1[X(C10H13ClO)]
method: RPBEPBE
basis: SDD
operation: Freq
keyword: #p
keyword: freq=noraman
keyword: PBEPBE/SDD
title: #p freq=noraman PBEPBE/SDD
converged: YES YES NO NO
title: Mulliken charges:
elementType: Cl O C C C C C C C C C C H H H H H H H H H H H H H
charge: -0.074335 -0.413092 -0.203912 0.456805 -0.679981 -0.677801 0.024424 -0.354497 0.574515 -0.549774 -0.354926 -0.800953 0.157906 0.218339 0.215248 0.230590 0.229975 0.215152 0.219753 0.255121 0.258192 0.244186 0.244193 0.224836 0.340039
chargesum: 0.00000
title: Mulliken charges with hydrogens summed into heavy atoms:
elementType: Cl O C C C C C C C C C C
charge: -0.074335 -0.073052 -0.046007 0.456805 -0.015804 -0.012922 0.024424 -0.099377 0.574515 -0.291582 -0.354926 -0.087738
polarizability: 1.60890995e+02 2.29221524e+00 1.29020320e+02 -1.27661827e-01 -3.36148523e-02 7.28637506e+01
1716.lowfreq: -9.8915 -0.0017 -0.0015 0.0011 8.7601 9.8833 31.7078 80.2242 114.0972
frequency: 29.3746 80.1904 114.0964 121.4908 153.9573 206.6269 215.6458 232.4173 243.8633 264.2838 285.1883 312.2584 346.4595 364.1615 401.8725 424.6500 486.7417 493.9467 549.5457 597.4645 621.9228 713.9900 729.1142 739.1810 871.3193 882.5826 887.0587 915.0804 955.6189 971.5214 1003.3892 1046.3689 1063.2626 1103.4111 1115.0511 1137.1175 1163.8929 1211.8957 1254.2100 1277.8936 1279.8386 1331.1767 1381.7548 1384.0276 1400.5830 1402.4958 1414.3024 1462.4417 1466.1365 1467.6205 1472.5486 1477.9750 1479.9645 1491.7423 1569.0722 1630.6587 2920.1967 2980.6253 2983.2793 2985.5805 3064.4998 3075.4817 3080.9014 3083.2888 3087.4947 3096.9531 3148.9356 3158.8072 3560.2622
redmass: 2.8524 3.4408 4.3940 1.0915 4.2741 1.3616 1.8182 1.8209 1.6088 3.0150 4.6374 4.0688 1.1528 7.6464 3.5424 2.9169 3.3632 3.5240 3.1617 6.0268 5.1738 5.6869 3.2461 3.6320 1.5062 1.4128 2.6099 1.1646 1.4558 3.9900 1.4616 1.5203 1.6926 2.3733 2.4220 1.4543 1.8871 1.9838 1.3235 4.8649 1.3750 2.0429 1.2023 2.4871 1.2482 1.2247 3.6421 1.0447 1.0452 1.0499 1.2964 1.4992 1.0966 1.4516 6.2211 7.4649 1.0814 1.0350 1.0355 1.0370 1.0972 1.1001 1.0996 1.1005 1.0998 1.0997 1.0916 1.0920 1.0652
irintensity: 0.0007 0.8013 0.0216 0.5370 0.3558 1.3611 3.6926 0.2662 0.3099 2.5060 0.0250 6.6672 116.6443 0.4181 0.0980 2.8857 9.2995 0.4697 13.7539 10.1461 0.1372 9.3973 1.0978 39.4880 0.1018 29.9891 3.6493 2.2840 0.1793 2.1959 23.7013 10.5532 17.9056 2.8238 2.5624 217.5968 7.5586 54.9470 11.0173 5.8112 0.8904 31.4742 16.1897 17.9174 14.7844 16.9142 5.7896 14.2251 3.2132 3.3749 17.0315 29.2263 25.2546 78.2939 12.2099 4.8785 55.0998 28.2137 33.8834 19.6042 14.5136 0.7082 86.1448 21.0699 37.0982 17.8920 4.9069 3.9857 28.0407
temp: 298.150 k
press: 1.00000 atm
elementType: 17 8 6 6 6 6 6 6 6 6 6 6 1 1 1 1 1 1 1 1 1 1 1 1 1
symmnumber: 1
zpe: 531900.2 jmol-1
zpe.correction: 0.202590 hartree
zpe.thermalcorrener: 0.215733 hartree
zpe.thermalcorrenthalpy: 0.216678 hartree
zpe.thermalcorrgfe: 0.162857 hartree
zpe.sumelectzpe: -923.243877 hartree
zpe.sumelectthermal: -923.230734 hartree
zpe.sumelectthermalent: -923.229789 hartree
zpe.sumelectthermalfe: -923.283610 hartree
dipole: 2.5665 -0.0055 -0.0075
dipole: 2.5665
quadrupole: -69.7073 -82.7151 -81.7593
quadrupole: -5.7100 -0.0465 -0.0002
quadrupole: 8.3532 -4.6546 -3.6987 -5.7100 -0.0465 -0.0002
hfenergy: -923.446467 hartree
pointgroup: C01 [X(C10H13Cl1O1)]
dipole: 0.9983412 -0.1508153 0.0117649 debye
dipolederiv: -0.3971842 0.2857395 -0.0069067 0.3688684 -0.5706306 0.010023 -0.0082802 0.0093447 -0.0781627 -0.5743977 0.5601708 -0.0080169 0.6160766 -0.9695326 0.0149276 -0.006995 0.0115685 -0.3955901 0.2040003 -0.0503757 0.0032889 -0.0770319 0.1431474 -0.0032079 0.0118219 -0.0026196 0.1530126 0.0810128 0.0352092 -0.0009631 0.251801 -0.2249323 0.0011854 -0.0071759 -0.0032761 -0.1620404 -0.0219428 -0.0345424 -0.0182342 -0.0222604 0.0301388 -0.0330927 0.0423591 -0.0288327 -0.0287621 -0.0243601 -0.0338368 0.0216103 -0.0251391 0.0351981 0.0269814 -0.0440007 0.0218367 -0.0346076 0.4356838 -0.5601262 0.0101371 -0.6175248 0.8390694 -0.0162948 0.0099452 -0.0142075 0.0746104 -0.0379105 0.0633183 -0.0000334 0.0456112 -0.1202021 0.0016787 -0.0005804 0.0022879 -0.0754078 0.2677528 0.1052661 0.0011392 0.1708191 -0.0539824 0.0022889 0.0000831 0.0025425 0.0218381 -0.2232606 0.1793716 -0.0029124 0.0419551 -0.0315586 -0.0016333 -0.0009066 0.0006789 -0.1788719 0.2545091 -0.488849 0.0109075 -0.6473473 0.6991927 -0.0172675 0.0127362 -0.016172 -0.1338921 -0.1722238 0.0109177 -0.0023426 0.064352 0.1129656 -0.0003166 -0.0032584 -0.0009086 0.0548355 -0.0078808 0.0803208 -0.0030785 0.0978615 -0.2339885 0.0118294 -0.0033471 0.009345 0.0154424 0.0644049 0.1106744 -0.0048969 0.0746876 -0.0951122 -0.0229934 -0.0204983 0.030364 0.0697456 -0.2273524 -0.0528817 -0.0365632 -0.0513321 0.0786273 -0.0244277 -0.0150147 -0.0198875 0.0771821 0.0996214 -0.0337001 0.0694245 -0.0141976 0.0327223 0.0973604 0.0485519 0.0621374 -0.1091468 0.1019262 -0.0383666 -0.0609534 -0.0151363 0.0172391 -0.1101528 -0.0437299 -0.0727883 -0.0964089 -0.2300893 -0.0513142 0.0344055 -0.0530972 0.0816649 0.0234362 0.0152435 0.0193218 0.0738107 0.0621647 0.1105212 -0.0041412 0.0751681 -0.0924157 0.0394759 0.0132798 -0.0145291 0.0701145 0.0794995 -0.0696325 0.0005924 -0.0788117 -0.0240686 0.0011785 0.0014708 0.0012773 0.139284 0.0487077 -0.0564797 -0.0003824 -0.0528211 -0.0421899 0.0021687 -0.0003819 0.0019036 0.1615349 -0.0040025 0.0007294 0.0483368 0.0305222 0.0670508 -0.0937713 0.0961392 -0.059419 -0.0264125 -0.0012021 -0.0018865 -0.0477045 0.0258565 0.0713571 0.0914915 -0.0964731 0.0566085 -0.0337247 0.0697931 0.0019222 -0.0004091 -0.1094374 -0.136623 0.002503 0.0011737 0.0034994 0.1095132 0.1527304 -0.0721698 -0.0023038 -0.0994422 0.3868631 -0.0033705 -0.0021622 -0.0000757 0.3321036 unknown
polarizability: 159.4653204|-6.9537313|130.4316064|0.8240843|-0.6864029|72.8781387 unknown
InChI: InChI=1S/C10H13ClO/c1-6(2)8-5-9(11)7(3)4-10(8)12/h4-6,12H,1-3H3
charge 0 multiplicity 1
25 atoms
Cl -2.457852 2.369783 -0.027026
O  1.032799 -2.540038 0.070414
C  2.396557 0.177224 0.049326
C  0.880543 -0.049039 0.0407
C  2.849847 0.973562 1.302063
C  2.876157 0.863601 -1.257895
C  0.288718 -1.343498 0.049862
C  -0.00115 1.060635 0.016465
C  -1.996072 -0.405396 0.014457
C  -1.115387 -1.509928 0.037562
C  -1.391547 0.876525 0.00395
C  -3.497725 -0.598763 0.001873
H  2.917994 -0.805475 0.098489
H  2.406169 1.985865 1.306414
H  3.949496 1.087252 1.314259
H  2.539577 0.466558 2.232926
H  2.587977 0.276645 -2.148081
H  3.975505 0.98145 -1.256288
H  2.428166 1.868867 -1.359366
H  0.404334 2.077285 0.007585
H  -1.513565 -2.529271 0.046381
H  -3.9698 -0.114631 0.876365
H  -3.951796 -0.140336 -0.895718
H  -3.756975 -1.670261 0.01475
H  2.004032 -2.349216 0.082132
