program: Gaussian 09
title: 000042333
version: EM64L-G09RevD.01
frameworkgroup: C1[X(C17H24ClN3O2)]
method: RPBEPBE
basis: SDD
operation: Freq
keyword: #p
keyword: freq=noraman
keyword: PBEPBE/SDD
title: #p freq=noraman PBEPBE/SDD
converged: NO YES NO NO
title: Mulliken charges:
elementType: Cl O O N N N C C C C C C C C C C C C C C C C C H H H H H H H H H H H H H H H H H H H H H H H H
charge: -0.062766 -0.259198 -0.247879 -0.095421 -0.063012 -0.212182 -0.364945 -0.346428 -0.343984 -0.388828 -0.378738 -0.446767 -0.392595 -0.614159 0.347936 0.174635 -0.133118 0.172881 -0.274840 -0.690790 -0.335152 -0.140581 -0.241038 0.230763 0.192007 0.187415 0.200201 0.197167 0.203867 0.208249 0.191808 0.184123 0.204471 0.240776 0.230713 0.209981 0.290695 0.221026 0.187414 0.223056 0.242300 0.265726 0.234630 0.229893 0.241217 0.259316 0.260155
chargesum: 0.00000
title: Mulliken charges with hydrogens summed into heavy atoms:
elementType: Cl O O N N N C C C C C C C C C C C C C C C C C
charge: -0.062766 -0.259198 -0.247879 -0.095421 -0.063012 -0.212182 0.057825 0.041188 0.057050 0.011229 0.009857 0.024721 0.108081 0.017337 0.347936 0.174635 0.109182 0.172881 -0.009115 0.014950 -0.075836 -0.140581 0.019116
polarizability: 2.74695927e+02 -2.77724287e+01 2.56562926e+02 1.30337774e+01 4.29044825e+00 1.38987352e+02
1716.lowfreq: -10.9373 -4.9137 -0.0012 -0.0008 0.0005 2.7895 12.0918 19.9820 30.9587
frequency: 8.2201 19.6818 30.7186 44.9568 55.3336 67.9723 86.6166 104.7045 138.5922 169.8867 175.8135 191.2023 204.4677 214.3334 223.2129 253.9193 263.5297 278.2964 301.0145 323.6449 329.2922 349.5565 351.0064 361.4366 381.2972 397.5469 411.6713 414.5720 436.5326 444.6915 477.7957 484.6411 511.2112 567.1307 568.5286 596.7628 622.7701 661.2859 699.9001 717.7308 731.9191 737.5549 758.5549 791.4322 801.1350 814.8759 850.7311 852.7821 869.5904 877.7723 917.5914 927.7094 934.5491 964.2247 1008.4762 1011.8424 1042.8238 1046.7165 1048.5165 1059.2042 1075.4031 1079.0500 1085.7478 1089.9271 1101.7233 1114.0146 1126.1317 1143.3958 1145.9627 1150.9984 1159.6712 1178.7195 1196.6326 1208.7002 1236.2749 1246.2755 1250.7555 1275.5119 1278.8074 1283.5786 1292.1092 1302.9737 1307.0314 1312.4458 1324.2454 1336.9289 1343.5997 1349.7622 1368.7650 1373.4975 1374.7242 1388.0795 1390.0488 1392.5752 1421.9668 1429.0645 1453.5455 1454.0043 1456.9294 1460.8177 1464.4831 1470.9751 1472.4779 1477.1999 1479.3770 1480.6544 1481.3213 1490.6669 1573.3621 1597.4281 1614.4630 2841.7989 2845.3710 2850.2693 2863.7920 2866.6827 2878.3001 2945.6814 2995.6076 3000.6826 3012.8076 3016.3679 3021.3201 3026.5863 3031.8134 3033.6543 3049.0014 3057.3878 3074.4447 3114.6606 3115.5997 3123.7122 3164.4337 3183.5499 3186.1279
redmass: 5.4349 3.9017 4.2419 5.0001 3.9483 4.3105 5.8898 3.7809 4.7669 5.8469 1.1352 4.4383 3.2958 2.5790 1.1611 2.7968 1.8547 2.0926 4.8947 3.8454 2.8509 3.6218 3.6140 3.8204 2.8590 3.8209 3.9329 2.5881 3.7648 5.7242 4.2581 3.1910 3.7437 4.2946 4.6578 2.0960 5.4773 5.0247 6.6208 4.2784 2.4313 3.3933 2.7253 1.6280 2.4372 1.8177 1.5252 1.4811 3.2552 1.8454 2.6172 2.4326 1.3407 2.4164 2.9498 2.3993 2.4114 2.2880 1.6294 1.7695 2.0363 1.9708 1.9914 1.9659 2.1152 1.8574 1.7987 2.0755 2.2501 2.6059 2.4302 1.8123 1.0957 2.0782 1.5797 1.5319 1.6422 1.7025 1.7412 1.6111 1.4961 1.4139 1.3339 1.4002 1.4102 1.3294 2.5654 1.3371 1.4414 1.4601 1.4154 5.3851 1.4484 1.2953 3.8627 1.1749 1.0795 1.0803 1.0489 1.0610 1.0818 1.0786 1.0857 1.1565 2.4949 1.0597 1.1105 1.1374 7.1332 9.1682 8.2526 1.0705 1.0680 1.0649 1.0655 1.0694 1.0669 1.0830 1.0839 1.0651 1.0356 1.0727 1.0909 1.0871 1.0900 1.0688 1.0905 1.0951 1.1009 1.0984 1.1013 1.0998 1.0888 1.0942 1.0950
irintensity: 0.0500 0.0310 0.2272 0.7064 0.2427 2.2497 0.7159 1.8188 2.3507 1.5901 0.2078 1.9322 0.4061 0.3827 0.1212 0.6553 4.3028 1.5291 5.9205 3.0793 15.5218 3.6154 1.7353 0.2863 3.7401 3.9568 8.8477 5.3025 4.8018 6.9877 6.3645 1.2980 2.1549 4.6521 9.1783 1.6865 12.4638 8.2216 18.9320 12.6199 1.9082 8.8641 17.2479 9.4542 24.6613 32.9334 0.5664 23.0207 20.7472 3.7471 6.6046 7.9559 1.0067 11.5419 37.2510 47.3940 3.8908 10.8213 4.7679 1.4629 5.2059 15.4186 11.5628 9.5782 14.5098 27.2974 10.6061 17.5342 5.4993 64.9304 26.3414 1.5080 1.0221 40.9435 64.5611 87.2213 7.6453 25.5228 32.8632 59.2083 7.4859 24.8338 9.2409 14.8347 19.0883 22.4488 72.7397 8.8535 5.2528 0.9062 6.3171 2.3261 1.8658 42.6071 38.9176 1.7930 0.8867 0.8137 16.4070 32.8883 11.2230 16.5459 22.3708 30.1376 185.6564 10.1925 8.1726 32.2816 108.2196 258.7274 24.6249 59.7839 67.9451 79.0178 44.8381 10.5004 355.8636 32.8344 16.8898 23.3310 13.9804 52.5018 33.6478 75.4234 38.9378 18.0890 20.4848 33.8513 34.9661 2.6813 21.1820 9.6905 1.5515 3.2212 0.0319
temp: 298.150 k
press: 1.00000 atm
elementType: 17 8 8 7 7 7 6 6 6 6 6 6 6 6 6 6 6 6 6 6 6 6 6 1 1 1 1 1 1 1 1 1 1 1 1 1 1 1 1 1 1 1 1 1 1 1 1
symmnumber: 1
zpe: 1021921.5 jmol-1
zpe.correction: 0.389229 hartree
zpe.thermalcorrener: 0.411692 hartree
zpe.thermalcorrenthalpy: 0.412636 hartree
zpe.thermalcorrgfe: 0.334708 hartree
zpe.sumelectzpe: -1435.196926 hartree
zpe.sumelectthermal: -1435.174463 hartree
zpe.sumelectthermalent: -1435.173519 hartree
zpe.sumelectthermalfe: -1435.251447 hartree
dipole: -0.1091 0.0417 -0.5893
dipole: 0.6008
quadrupole: -141.5153 -146.0051 -145.8196
quadrupole: 10.0329 3.0641 -1.9973
quadrupole: 2.9314 -1.5584 -1.3730 10.0329 3.0641 -1.9973
hfenergy: -1435.5861551 hartree
pointgroup: C01 [X(C17H24Cl1N3O2)]
dipole: 0.0438684 -0.0330212 -0.2298885 debye
polarizability: 270.4115704|-29.4669441|260.3030227|-10.3057901|-10.5092732|139.5316128 unknown
InChI: InChI=1S/C17H24ClN3O2/c1-13-17(22)21(15-12-14(18)4-5-16(15)23-13)7-3-6-20-10-8-19(2)9-11-20/h4-5,12-13H,3,6-11H2,1-2H3
charge 0 multiplicity 1
47 atoms
Cl -3.958171 3.948993 -0.725339
O  -3.372896 -1.933779 0.39218
O  0.161112 -2.425191 -0.179775
N  3.003054 0.95902 0.317751
N  5.678106 -0.097186 -0.080375
N  -1.072572 -0.443832 -0.308047
C  3.447105 -0.287337 0.996178
C  4.162132 1.854824 0.077225
C  1.90496 1.65865 1.026819
C  4.52519 -0.996693 0.161111
C  5.231523 1.139074 -0.762778
C  0.5928 0.845978 1.067876
C  0.186567 0.346646 -0.334841
C  6.779137 -0.77036 -0.793501
C  -2.347324 0.198387 -0.273178
C  -0.958524 -1.838439 -0.251102
C  -2.283005 -2.621367 -0.35933
C  -3.495558 -0.567061 0.087257
C  -2.508996 1.583496 -0.522856
C  -2.181701 -4.034014 0.203805
C  -4.760439 0.034745 0.212269
C  -3.785615 2.160954 -0.399713
C  -4.920854 1.417559 -0.029253
H  2.585991 -0.969298 1.109835
H  3.860274 -0.066154 2.012652
H  4.627671 2.188792 1.038989
H  3.809405 2.753487 -0.463822
H  2.190597 1.928366 2.077005
H  1.724208 2.61258 0.491671
H  4.879934 -1.890577 0.7075
H  4.063568 -1.341524 -0.799581
H  4.804635 0.918763 -1.775562
H  6.103428 1.807163 -0.895885
H  0.694529 -0.027281 1.738292
H  -0.200795 1.487223 1.498057
H  0.079399 1.188164 -1.041047
H  0.977946 -0.307181 -0.729592
H  7.635339 -0.078917 -0.894004
H  6.495894 -1.122011 -1.8186
H  7.115457 -1.64845 -0.213148
H  -2.578663 -2.644124 -1.431794
H  -1.66074 2.212048 -0.799531
H  -1.950099 -4.001969 1.281146
H  -3.136611 -4.565524 0.057721
H  -1.37339 -4.58167 -0.306454
H  -5.61045 -0.589057 0.502898
H  -5.899558 1.894385 0.065272
