program: Gaussian 16
title: 1ac
version: EM64L-G16RevC.01
frameworkgroup: C1[X(C13H16FNO2)]
method: RM06L
basis: def2SVP
operation: Freq
keyword: #P
keyword: Geom=AllCheck
keyword: Guess=TCheck
keyword: SCRF=Check
keyword: Test
keyword: GenChk
keyword: RM06L/def2SVPFreq
converged: YES YES NO YES
title: Mulliken charges:
elementType: C C C C C C H C O N O C H H C C C C H H C H H H H H H H H H H H F
charge: 0.045599 -0.140178 0.340025 -0.135167 -0.041168 -0.086872 0.052487 0.282174 -0.333556 -0.042104 -0.362326 0.098258 0.059115 0.061587 -0.408325 0.043325 0.100266 -0.063083 0.049584 0.055503 -0.084414 0.045243 0.043649 0.045737 0.057528 0.056460 0.042345 0.199732 0.078757 0.071208 0.067959 0.060142 -0.259492
chargesum: -0.00000
title: Mulliken charges with hydrogens summed into heavy atoms:
elementType: C C C C C C C O N O C C C C C C F
charge: 0.045599 -0.080036 0.340025 -0.063959 0.026792 -0.034385 0.282174 -0.333556 0.157628 -0.362326 0.297717 -0.408325 0.148412 0.189158 0.040182 0.014391 -0.259492
chargesum: 0.00000
polarizability: 2.30679243e+02 -7.45004117e+00 1.86623202e+02 -1.52886088e+01 -1.90752366e+01 1.88271332e+02
1716.lowfreq: -13.8552 -0.0008 -0.0005 0.0005 2.7723 7.1689 26.1813 41.8041 56.7104
frequency: 25.2653 41.6810 56.6996 59.1414 79.9558 88.4696 147.1400 168.2855 211.5147 236.0496 246.4458 279.2446 303.0610 342.5404 362.2793 373.7070 392.9421 413.8647 460.8694 474.3958 516.3492 530.3830 537.0703 623.9090 638.2412 675.9950 716.4658 756.0901 770.9575 792.6116 843.3005 872.1476 877.9587 889.0239 901.8577 909.0176 939.6619 963.0552 977.5962 991.5855 1003.4914 1016.6250 1023.2585 1036.5242 1074.7707 1087.2897 1092.2878 1128.6402 1149.2593 1151.2645 1165.3017 1203.5960 1207.6453 1219.4444 1248.5848 1256.6049 1278.6358 1288.6238 1295.4575 1312.4744 1341.0047 1344.9901 1354.4855 1409.3688 1417.7558 1419.9214 1424.1386 1435.0330 1441.8094 1447.7431 1453.8359 1473.1692 1509.5378 1523.2346 1650.8487 1677.3891 1802.0391 3010.5840 3036.0874 3039.1518 3043.1849 3060.6551 3117.0065 3120.0006 3124.4847 3128.1018 3143.4013 3181.8233 3184.3123 3186.1337 3202.7836 3210.9577 3547.0663
redmass: 4.9899 4.0510 3.2494 4.1679 4.8424 3.6341 4.4572 1.5614 1.9444 4.6751 3.5714 3.4878 3.3090 5.5660 2.0169 4.1885 1.7628 2.4912 4.5129 3.0556 3.2619 5.1854 1.9410 4.3407 3.9372 3.0124 2.1628 4.0701 3.0834 1.5171 1.8722 1.8186 2.6807 2.5393 1.5541 1.8821 2.2167 2.7698 2.4127 1.3008 1.9296 5.6481 2.3507 1.4981 2.1347 2.2321 1.5948 3.6478 1.8616 1.3172 1.1612 1.5860 2.0136 2.0638 1.4105 1.3278 2.1999 1.8674 1.6156 2.0243 1.6145 1.4542 1.4681 7.8385 1.0506 1.0927 1.1213 1.1031 1.1242 1.0670 1.2106 2.9705 1.6619 2.8723 6.9857 7.2733 11.6577 1.0330 1.0667 1.0657 1.0681 1.0659 1.1017 1.1038 1.1089 1.0999 1.1034 1.1054 1.0915 1.0895 1.0930 1.0978 1.0811
irintensity: 0.0676 8.2530 1.0868 0.9898 8.7256 7.5061 4.5695 2.7889 3.9609 2.2074 1.3122 20.8698 8.5697 7.2953 3.8970 18.5174 83.9064 73.5482 6.5108 6.6647 2.4560 8.1829 8.1159 2.7845 0.2767 6.7309 29.4707 13.6436 10.3583 57.0973 20.3772 30.0208 43.9201 24.4857 4.6885 21.9981 2.8796 1.8747 21.3758 0.5609 2.8931 0.5226 42.9801 17.1097 38.2876 18.9498 56.7763 18.8351 25.9552 3.7981 13.4689 5.3365 0.7912 64.2788 3.2694 2.9983 60.5994 37.6047 18.6212 19.4438 1.9270 3.1946 12.6231 4.1080 17.3488 13.7477 3.6818 7.6764 10.6040 8.2727 1.9839 41.1941 135.6213 84.9752 114.1390 132.0452 422.2129 61.3214 61.8563 69.9348 61.0722 46.0432 46.9380 69.1060 40.2715 32.6193 18.6827 16.3280 10.7309 3.1913 12.4461 4.1754 75.0104
temp: 298.150 k
press: 1.00000 atm
elementType: 6 6 6 6 6 6 1 6 8 7 8 6 1 1 6 6 6 6 1 1 6 1 1 1 1 1 1 1 1 1 1 1 9
symmnumber: 1
zpe: 712906.4 jmol-1
zpe.correction: 0.271532 hartree
zpe.thermalcorrener: 0.287525 hartree
zpe.thermalcorrenthalpy: 0.288469 hartree
zpe.thermalcorrgfe: 0.226590 hartree
zpe.sumelectzpe: -809.059968 hartree
zpe.sumelectthermal: -809.043975 hartree
zpe.sumelectthermalent: -809.043031 hartree
zpe.sumelectthermalfe: -809.104910 hartree
dipole: -0.4575 2.7199 -5.6522
dipole: 6.2893
quadrupole: -96.7918 -101.4046 -98.8410
quadrupole: 3.6564 4.7415 3.9931
quadrupole: 2.2207 -2.3921 0.1714 3.6564 4.7415 3.9931
hfenergy: -809.3315 hartree
pointgroup: C01 [X(C13H16F1N1O2)]
dipole: -0.0579961 -0.9251447 -2.2941989 debye
polarizability: 233.9350715|-4.4607545|183.7800194|9.0328585|19.9858059|187.8586862 unknown
InChI: InChI=1S/C13H16FNO2/c1-17-15-12(16)13(7-2-3-8-13)10-5-4-6-11(14)9-10/h4-6,9,15H,2-3,7-8H2,1H3
charge 0 multiplicity 1
33 atoms
C  -0.23339631 -0.36055753 0.0458296
C  -0.83764923 0.46871368 1.00318858
C  -2.20438802 0.69758884 0.95072067
C  -3.01923299 0.12904115 -0.02113864
C  -2.41909575 -0.70162411 -0.96437712
C  -1.04464317 -0.9462265 -0.93455316
H  -0.6101467 -1.61044088 -1.68416693
C  2.05904585 0.60305372 0.50600857
O  2.90403311 0.6708858 1.3821559
N  1.77679853 1.63837378 -0.3330347
O  2.54481948 2.77839309 -0.30641804
C  3.76818611 2.5863768 -1.00600086
H  3.59270627 2.34337343 -2.06673031
H  4.38012416 1.79678754 -0.54311293
C  1.2511679 -0.663239 0.17790324
C  1.91296234 -1.28897576 -1.088352
C  1.46633107 -1.73529293 1.28420674
C  2.10849514 -2.76163481 -0.76406598
H  2.90229531 -0.82511074 -1.24068837
H  1.3466449 -1.09059917 -2.00897097
C  2.46933074 -2.72637149 0.71249599
H  0.51133282 -2.24807148 1.47632886
H  1.78471808 -1.27220374 2.22791413
H  1.16483302 -3.31612639 -0.90603671
H  2.86564488 -3.24306322 -1.40015888
H  2.43061588 -3.70838792 1.20616247
H  3.49624162 -2.34162282 0.83451478
H  1.21035462 1.52371234 -1.17384835
H  4.3051333 3.53999703 -0.94174467
H  -4.09024165 0.33846222 -0.02675747
H  -3.03448593 -1.16757756 -1.73755477
H  -0.25319579 0.94205549 1.79675649
F  -2.75956098 1.50045475 1.87521893
