program: Gaussian 16
title: 1ac
version: EM64L-G16RevC.01
frameworkgroup: C1[X(C14H16F3NO2)]
method: RM06L
basis: def2SVP
operation: Freq
keyword: #P
keyword: Geom=AllCheck
keyword: Guess=TCheck
keyword: SCRF=Check
keyword: Test
keyword: GenChk
keyword: RM06L/def2SVPFreq
converged: YES YES NO NO
title: Mulliken charges:
elementType: C C C C C H H C O N O C H H C C C C H H C H H H H H H H H H H C C F F F
charge: 0.046691 -0.049300 -0.024945 -0.042317 -0.067633 0.068121 0.059539 0.280307 -0.331649 -0.042439 -0.362339 0.097796 0.059348 0.061837 -0.408508 0.040776 0.102360 -0.062948 0.051042 0.056585 -0.084616 0.045726 0.044572 0.046243 0.057840 0.057206 0.042995 0.057289 0.200448 0.079112 0.062253 -0.206315 0.758945 -0.221989 -0.236212 -0.235822
chargesum: -0.00000
title: Mulliken charges with hydrogens summed into heavy atoms:
elementType: C C C C C C O N O C C C C C C C C F F F
charge: 0.046691 0.007988 0.037308 0.025804 -0.008094 0.280307 -0.331649 0.158010 -0.362339 0.298093 -0.408508 0.148403 0.192658 0.041135 0.015585 -0.206315 0.758945 -0.221989 -0.236212 -0.235822
chargesum: 0.00000
polarizability: 2.41416635e+02 2.63515058e+00 2.06205630e+02 1.30392772e+01 2.54677497e+01 1.97714684e+02
1716.lowfreq: -15.8453 -6.7518 -0.0004 0.0006 0.0006 4.6860 17.3611 37.7682 44.0109
frequency: 14.4509 37.2006 43.4517 47.9337 60.8780 78.9276 94.4479 112.5296 132.3490 169.4918 192.3921 217.8722 249.7747 275.3555 302.5131 328.9532 333.0690 344.8237 362.5894 381.0305 396.1884 410.1996 445.8858 474.0854 516.2932 533.0000 540.6796 585.5981 635.4865 655.8562 666.5949 690.1785 724.2920 756.7759 767.8198 810.8098 834.9703 842.9126 876.6021 902.5916 916.5728 933.0751 938.8989 961.7174 976.9506 995.1459 1005.5257 1013.1686 1019.8175 1034.7715 1074.4551 1083.1123 1095.8103 1114.6699 1119.5949 1131.8715 1152.0880 1162.1399 1164.8735 1176.9251 1204.2380 1208.0886 1245.1525 1255.6175 1269.3599 1278.9643 1303.2183 1320.4076 1339.6896 1342.1763 1346.7113 1363.3061 1410.3908 1416.8640 1418.4419 1424.7164 1434.7499 1438.6394 1449.2730 1451.6346 1469.1258 1506.8491 1531.3854 1656.7982 1678.2789 1803.6233 3011.5546 3036.3823 3039.9091 3043.5078 3060.0405 3117.4267 3121.0536 3125.5148 3125.8804 3143.0120 3166.1187 3182.6479 3185.0064 3197.0985 3212.1632 3545.2636
redmass: 5.3789 4.6519 13.0119 4.8302 3.2173 4.6421 3.3810 6.2113 6.3806 2.2694 2.2755 2.0922 3.0028 4.3781 3.3326 3.3916 4.5290 5.3958 2.8660 4.0148 1.9987 2.4843 5.1647 4.3977 3.2901 1.9836 4.5908 11.1647 3.6987 5.5007 5.8930 3.9654 1.7609 5.1208 3.4487 1.7731 4.2941 1.9573 2.2884 2.0682 1.5886 1.4049 2.2119 2.7875 2.3104 2.1595 1.3362 5.4524 3.0285 1.3980 2.2293 3.5290 2.5432 1.9362 11.0328 3.0434 1.3093 4.1759 1.7015 1.2772 1.5861 2.0278 1.4353 1.3387 2.3443 2.2923 1.4324 1.3837 1.5902 1.7147 1.4534 2.8428 7.6081 1.0947 1.0417 1.1326 1.0951 1.1131 1.0693 1.1523 3.7101 1.6709 2.8815 6.8050 6.3006 11.6769 1.0331 1.0666 1.0659 1.0678 1.0658 1.1018 1.1032 1.1020 1.1077 1.1036 1.0923 1.1055 1.0873 1.0944 1.0965 1.0810
irintensity: 0.1150 8.9988 0.2739 1.1643 0.2912 6.8129 9.3749 1.9784 0.5578 0.9110 10.0258 6.5159 1.7717 4.9208 16.3368 2.1102 4.3443 5.2923 9.0358 11.9737 84.2501 81.5677 7.9145 1.7008 1.5848 9.3412 5.0427 1.0943 4.5199 12.7818 5.0462 20.8603 50.2826 2.8273 13.1075 48.2185 19.0321 4.4463 21.0829 24.3128 5.9172 7.0930 2.1696 2.8244 19.7809 13.1272 1.6472 15.2781 38.0571 8.7801 46.7720 100.9959 131.6881 26.1483 419.8526 19.0094 2.7665 246.6922 40.8088 46.6729 4.9214 2.2473 4.7383 4.4308 67.1147 81.7063 27.7581 3.9522 5.3513 174.3804 23.0367 234.8775 10.4644 14.9550 16.6990 1.9730 9.3397 13.9027 7.5492 12.3762 52.7131 137.3184 18.2270 19.2240 10.4437 429.6087 60.8892 61.0269 68.4319 58.6070 45.2015 47.4508 63.5398 54.1477 18.6894 18.6827 6.8920 15.4936 4.3483 12.3672 7.3393 75.8280
temp: 298.150 k
press: 1.00000 atm
elementType: 6 6 6 6 6 1 1 6 8 7 8 6 1 1 6 6 6 6 1 1 6 1 1 1 1 1 1 1 1 1 1 6 6 9 9 9
symmnumber: 1
zpe: 746459.7 jmol-1
zpe.correction: 0.284311 hartree
zpe.thermalcorrener: 0.303074 hartree
zpe.thermalcorrenthalpy: 0.304018 hartree
zpe.thermalcorrgfe: 0.234822 hartree
zpe.sumelectzpe: -1046.649488 hartree
zpe.sumelectthermal: -1046.630726 hartree
zpe.sumelectthermalent: -1046.629782 hartree
zpe.sumelectthermalfe: -1046.698978 hartree
dipole: 3.4182 -3.9310 -5.7175
dipole: 7.7348
quadrupole: -115.5575 -114.3710 -113.8541
quadrupole: 4.1978 -6.2138 -2.8610
quadrupole: -0.9633 0.2232 0.7401 4.1978 -6.2138 -2.8610
hfenergy: -1046.9337999 hartree
pointgroup: C01 [X(C14H16F3N1O2)]
dipole: 1.1306395 -1.6549483 -2.2898159 debye
polarizability: 243.0021608|1.9590012|206.6694483|12.1483148|24.4430067|195.66534 unknown
InChI: InChI=1S/C14H16F3NO2/c1-20-18-12(19)13(7-2-3-8-13)10-5-4-6-11(9-10)14(15,16)17/h4-6,9,18H,2-3,7-8H2,1H3
charge 0 multiplicity 1
36 atoms
C  -0.29896219 -0.74964873 -0.26899054
C  -1.28409567 0.04243934 0.33313278
C  -3.02339004 -1.03954255 -0.96435453
C  -2.05119919 -1.83931175 -1.56013838
C  -0.70749364 -1.69802319 -1.21656275
H  -2.34401004 -2.58505212 -2.30246709
H  0.0297882 -2.34669315 -1.69504472
C  1.54186061 0.84500987 0.40556166
O  2.10925753 1.27010626 1.39699208
N  1.24497665 1.62479946 -0.67179122
O  1.71242042 2.9160536 -0.73915645
C  3.08114154 2.9443153 -1.12514013
H  3.22895568 2.4954563 -2.12100239
H  3.71992675 2.4303707 -0.39031165
C  1.14258027 -0.62487373 0.19733464
C  2.20400462 -1.23454166 -0.7711467
C  1.33468674 -1.42244994 1.5179651
C  2.67073135 -2.52326558 -0.1121828
H  3.05975593 -0.54238214 -0.84522811
H  1.82794344 -1.35245584 -1.79715257
C  2.65481811 -2.16240829 1.36460599
H  0.51510505 -2.15051453 1.61871994
H  1.29267318 -0.75800316 2.3915622
H  1.95171846 -3.33772539 -0.30621385
H  3.64986958 -2.86149978 -0.48156235
H  2.74212344 -3.02779606 2.03763683
H  3.49751888 -1.48730095 1.59170385
H  -1.00220017 0.78335399 1.08830925
H  0.95280336 1.22898035 -1.56595255
H  3.36125963 4.00343403 -1.16516004
H  -4.07482033 -1.14702314 -1.23487153
C  -2.62964739 -0.09872721 -0.0117964
C  -3.62932934 0.79320007 0.65714222
F  -4.89319785 0.51533086 0.30737448
F  -3.41889162 2.09193817 0.36164501
F  -3.56439176 0.70281869 1.99990097
