program: Gaussian 09
title: 000042319
version: EM64L-G09RevD.01
frameworkgroup: C1[X(C15H19ClN2O2)]
method: RPBEPBE
basis: SDD
operation: Freq
keyword: #p
keyword: freq=noraman
keyword: PBEPBE/SDD
title: #p freq=noraman PBEPBE/SDD
converged: YES YES NO NO
title: Mulliken charges:
elementType: Cl O O N N C C C C C C C C C C C C C C C H H H H H H H H H H H H H H H H H H H
charge: -0.061292 -0.258987 -0.243988 -0.089200 -0.207843 -0.368365 -0.347623 -0.437444 -0.449131 -0.372370 -0.444690 0.329535 0.178749 -0.133474 0.172020 -0.259030 -0.690910 -0.335586 -0.156935 -0.237893 0.181191 0.227350 0.220737 0.190406 0.229827 0.208935 0.211348 0.226952 0.215810 0.231600 0.240750 0.278588 0.240478 0.282411 0.235710 0.230466 0.242383 0.259491 0.260026
chargesum: 0.00000
title: Mulliken charges with hydrogens summed into heavy atoms:
elementType: Cl O O N N C C C C C C C C C C C C C C C
charge: -0.061292 -0.258987 -0.243988 -0.089200 -0.207843 0.040176 0.063520 0.001319 -0.010831 0.075039 0.074648 0.329535 0.178749 0.107004 0.172020 0.023380 0.017649 -0.076095 -0.156935 0.022133
polarizability: 2.19568782e+02 6.91564499e+00 2.43291552e+02 5.62768655e+00 4.36813889e-01 1.14829383e+02
1716.lowfreq: 0.0010 0.0019 0.0025 2.1392 6.3148 8.5783 20.4516 37.3835 43.0833
frequency: 20.3733 36.9058 42.9511 46.8103 63.1206 80.3801 97.9656 123.9929 139.0565 157.2863 182.2447 186.3986 221.0775 255.3994 289.6419 308.3574 329.1219 344.9902 354.3042 365.2264 395.8305 435.1856 441.3378 460.8752 480.2903 550.8788 568.6658 579.2288 626.6053 635.0531 659.0750 700.2858 719.4824 738.7372 762.1494 792.6711 805.9280 818.1822 849.1885 857.5805 860.5593 872.5060 898.6778 928.1074 935.4785 963.8934 968.4194 1006.0515 1039.7522 1058.6466 1068.3726 1073.8387 1083.0136 1093.6350 1096.5778 1106.9330 1142.0315 1147.2650 1155.6218 1184.8575 1193.5694 1201.3449 1225.3113 1233.4484 1244.6680 1255.8503 1281.5145 1285.4740 1292.8122 1296.6817 1303.0001 1306.3546 1321.0665 1339.0390 1343.7948 1356.6902 1385.8874 1392.9910 1394.0670 1424.0822 1457.8014 1466.0349 1468.6106 1473.2974 1476.6377 1479.0852 1483.1974 1484.1601 1496.3109 1575.6870 1600.1719 1616.3689 2846.9432 2857.6374 2869.8377 2942.1722 3013.3578 3013.8721 3020.6618 3025.1516 3034.5930 3037.2151 3046.6665 3069.6141 3094.4939 3101.8283 3115.9677 3124.6072 3164.9663 3183.6480 3186.2082
redmass: 5.1502 2.2679 3.0923 2.5435 3.8780 6.3627 3.6748 3.7558 4.9539 4.9907 1.2791 3.7277 2.3061 2.9568 6.1662 5.8649 2.1382 4.8184 5.6299 3.2986 4.2438 3.9292 6.2853 5.2318 5.1308 4.5683 4.6553 4.7164 4.1764 2.9436 4.5958 6.0941 4.4683 2.8949 1.6008 1.3512 1.8893 2.2597 1.5290 2.2236 1.7019 3.2579 2.6228 3.1529 1.3399 2.2327 1.5854 3.0368 2.5850 2.9490 2.4214 2.3413 2.0827 1.6426 1.9925 1.9760 1.8577 2.1180 2.2165 1.5913 1.3445 1.7101 1.5343 1.6331 1.4694 1.4024 1.3394 2.0450 1.2542 1.3290 1.4586 1.4504 1.4743 1.7203 1.9786 1.4548 2.9007 1.7889 1.3352 3.6929 1.0488 1.0832 1.0966 1.0579 1.0956 1.0810 1.3310 2.0611 1.1045 7.5181 9.3191 8.1430 1.0710 1.0721 1.0696 1.0827 1.0356 1.0599 1.0874 1.0680 1.0743 1.0708 1.0866 1.1048 1.1054 1.1051 1.1013 1.0999 1.0887 1.0939 1.0957
irintensity: 0.1044 0.2604 0.3214 0.2545 1.6501 1.7448 0.1948 0.1941 2.2820 0.9941 0.2074 0.1716 4.0835 1.4920 7.0079 9.1328 3.4590 3.8716 1.4782 3.3210 8.4988 9.2191 8.3700 1.6131 7.5971 3.1359 8.9794 10.6046 11.2599 0.5028 4.7661 18.6111 11.8132 0.9022 1.7329 11.7897 29.2272 35.7462 1.4397 5.5997 30.8081 15.2895 6.5751 5.1470 1.0571 0.0988 3.2332 61.8842 14.7542 2.7983 1.4992 17.7704 16.6091 4.9175 29.1190 8.8513 15.5451 49.0016 6.5819 5.2603 6.6669 35.3781 49.5793 14.7942 45.6380 55.2939 23.5125 69.0532 6.5496 13.1848 34.8255 13.6873 9.3157 33.1228 56.2645 2.0792 2.0959 14.0566 35.5924 24.7405 14.5555 2.6475 31.2534 12.5007 3.0721 0.7633 65.3263 154.4277 5.4896 94.5142 246.4682 36.0121 59.7332 49.9894 139.2444 32.2755 14.3235 19.4221 13.9171 75.3726 35.4796 40.0415 21.4165 0.7010 71.4428 8.0581 20.4081 9.2295 1.5388 2.1225 0.3468
temp: 298.150 k
press: 1.00000 atm
elementType: 17 8 8 7 7 6 6 6 6 6 6 6 6 6 6 6 6 6 6 6 1 1 1 1 1 1 1 1 1 1 1 1 1 1 1 1 1 1 1
symmnumber: 1
zpe: 832071.7 jmol-1
zpe.correction: 0.316919 hartree
zpe.thermalcorrener: 0.336036 hartree
zpe.thermalcorrenthalpy: 0.336980 hartree
zpe.thermalcorrgfe: 0.267077 hartree
zpe.sumelectzpe: -1301.498840 hartree
zpe.sumelectthermal: -1301.479723 hartree
zpe.sumelectthermalent: -1301.478779 hartree
zpe.sumelectthermalfe: -1301.548682 hartree
dipole: -0.7011 -0.2405 1.3807
dipole: 1.5670
quadrupole: -112.3565 -137.8398 -125.3015
quadrupole: -4.0117 1.5964 -2.0783
quadrupole: 12.8094 -12.6739 -0.1356 -4.0117 1.5964 -2.0783
hfenergy: -1301.815759 hartree
pointgroup: C01 [X(C15H19Cl1N2O2)]
dipole: -0.2700686 -0.099877 0.545141 debye
polarizability: 218.8106627|5.5481673|244.016998|5.5674554|-1.8896192|114.8620568 unknown
InChI: InChI=1S/C15H19ClN2O2/c1-11-15(19)18(9-8-17-6-2-3-7-17)13-10-12(16)4-5-14(13)20-11/h4-5,10-11H,2-3,6-9H2,1H3
charge 0 multiplicity 1
39 atoms
Cl 1.497688 4.443591 -0.12447
O  3.194488 -1.328615 -0.033413
O  -0.025711 -3.001347 -0.077003
N  -3.206089 0.277038 0.043916
N  0.452154 -0.721835 -0.248108
C  -4.069862 0.871005 1.10045
C  -4.034721 -0.800973 -0.563876
C  -5.46414 0.955852 0.429792
C  -5.447244 -0.166959 -0.664121
C  -1.874442 -0.137714 0.516685
C  -0.941008 -0.448897 -0.678289
C  1.396158 0.33999 -0.111319
C  0.795842 -2.047473 0.047705
C  2.219676 -2.262606 0.599232
C  2.780752 0.014956 -0.018655
C  1.014658 1.703901 -0.136397
C  2.737358 -3.675844 0.353157
C  3.760751 1.022485 0.017866
C  2.013462 2.693614 -0.08951
C  3.384317 2.383891 -0.021086
H  -4.117994 0.214519 2.006937
H  -3.677172 1.854836 1.414114
H  -3.636342 -1.105192 -1.547298
H  -4.055927 -1.709261 0.090908
H  -5.605154 1.944058 -0.039729
H  -6.273761 0.814278 1.166474
H  -6.234659 -0.923462 -0.502947
H  -5.603381 0.271012 -1.664436
H  -1.917976 -1.037166 1.181769
H  -1.44768 0.691212 1.112727
H  -0.948636 0.394664 -1.3887
H  -1.294055 -1.352832 -1.200736
H  2.197316 -2.036908 1.688829
H  -0.034968 1.997614 -0.20309
H  2.826208 -3.868196 -0.728775
H  3.727861 -3.799748 0.821196
H  2.033927 -4.409423 0.778253
H  4.813124 0.729673 0.071149
H  4.137579 3.175064 0.007401
