program: Gaussian 16
title: OAc
version: EM64L-G16RevC.01
frameworkgroup: C1[X(C2H3O2)]
method: RM06L
basis: def2SVP
operation: Freq
keyword: #P
keyword: Geom=AllCheck
keyword: Guess=TCheck
keyword: SCRF=Check
keyword: Test
keyword: GenChk
keyword: RM06L/def2SVP
keyword: Freq
converged: YES YES YES YES
title: Mulliken charges:
elementType: C O O C H H H
charge: 0.143184 -0.524428 -0.524763 -0.175344 0.044916 0.018463 0.017971
chargesum: -1.00000
title: Mulliken charges with hydrogens summed into heavy atoms:
elementType: C O O C
charge: 0.143184 -0.524428 -0.524763 -0.093994
polarizability: 3.55289336e+01 -2.02858779e-02 3.95899437e+01 -1.41333072e-01 7.70360378e-04 2.60683837e+01
1716.lowfreq: -97.4039 -74.8742 -11.5210 0.0011 0.0013 0.0015 32.0890 437.6985 595.5350
frequency: 15.9042 437.3844 595.5349 651.8636 901.4247 986.1748 1014.6784 1301.6855 1406.2147 1408.2891 1433.2420 1768.2842 3011.1301 3119.8801 3133.7847
redmass: 1.0914 2.7900 2.2938 4.5832 6.4571 1.5041 2.1570 1.2914 3.5649 1.0598 1.3026 11.1934 1.0374 1.1017 1.1058
irintensity: 0.8638 0.5627 7.4476 16.7292 73.2054 6.6654 10.9846 4.8082 347.7476 26.7478 85.9737 627.8451 42.5802 46.1824 70.4627
temp: 298.150 k
press: 1.00000 atm
elementType: 6 8 8 6 1 1 1
symmnumber: 1
zpe: 126717.3 jmol-1
zpe.correction: 0.048264 hartree
zpe.thermalcorrener: 0.052737 hartree
zpe.thermalcorrenthalpy: 0.053681 hartree
zpe.thermalcorrgfe: 0.019929 hartree
zpe.sumelectzpe: -228.352781 hartree
zpe.sumelectthermal: -228.348308 hartree
zpe.sumelectthermalent: -228.347364 hartree
zpe.sumelectthermalfe: -228.381116 hartree
dipole: 3.8923 0.0055 0.1304
dipole: 3.8945
quadrupole: -29.8974 -33.4476 -23.9896
quadrupole: 0.0050 0.2497 0.0004
quadrupole: -0.7859 -4.3361 5.1220 0.0050 0.2497 0.0004
hfenergy: -228.4010447 hartree
pointgroup: C01 [X(C2H3O2)]
dipole: 1.5223558 -0.1608597 -0.0652965 debye
dipolederiv: 1.9535093 0.0239488 -0.1064787 0.023356 2.093846 0.1578516 -0.0985571 0.1568966 0.1498903 -1.0963409 0.4121036 0.08305 0.2767439 -1.6109252 -0.1005262 0.063122 -0.1200139 -0.564555 -1.2646666 -0.4975159 0.0182558 -0.3612584 -1.4504559 -0.0569514 0.0229848 -0.0356711 -0.5572479 -0.5602005 0.0821052 -0.0070894 0.086796 0.1627659 0.0064381 -0.0595665 0.0123724 0.0950624 0.0054098 0.0135695 -0.0603697 0.0192289 0.0818077 0.0268508 -0.1288552 0.0338787 -0.1451772 0.0008506 0.0298482 0.0275112 0.1031711 -0.1392511 -0.1324471 0.0999497 -0.1254236 -0.0067572 -0.0385616 -0.0640594 0.0451207 -0.1480376 -0.1377875 0.0987842 0.1009223 0.0779609 0.0287846 unknown
polarizability: 35.5107098|0.4851316|39.4578537|-0.7441222|1.0814805|26.2186975 unknown
InChI: InChI=1S/C2H3O2/c1-2(3)4/h1H3
charge -1 multiplicity 1
7 atoms
C  -0.15828657 0.0415823 0.04751411
O  -0.57953663 1.21332685 0.18825507
O  -0.82034725 -1.02202623 0.02118978
C  1.37616313 -0.11675458 -0.06198622
H  1.80429527 -0.24894534 0.94603524
H  1.66410529 -1.00552965 -0.64492402
H  1.86001475 0.77221764 -0.49585597
