program: Gaussian 16
title: D TS from Scan5
version: EM64L-G16RevC.01
frameworkgroup: C1[X(C21H23NO4Pd)]
method: RM06L
basis: def2SVP
operation: Freq
keyword: #P
keyword: Geom=AllCheck
keyword: Guess=TCheck
keyword: SCRF=Check
keyword: Test
keyword: GenChk
keyword: RM06L/def2SVPFreq
converged: YES YES YES YES
title: Mulliken charges:
elementType: C C C C C H H H H C C C C C H C H H C C C C C C H H C H H H H H H H O N O C H H H Pd H C C H H O O H
charge: 0.108170 -0.078532 -0.052058 -0.042227 -0.111218 0.049610 0.061050 0.059493 0.048048 0.109009 -0.364434 -0.063153 0.023465 -0.026946 0.053773 -0.051230 0.064824 0.072798 -0.023270 0.406779 -0.371301 0.055014 0.108766 -0.049312 0.046277 0.052603 -0.055753 0.043456 0.021674 0.042016 0.055909 0.048735 0.040419 0.067328 -0.464722 -0.056169 -0.380490 0.115017 0.061117 0.057374 0.076074 0.398925 0.103144 -0.097193 0.349565 0.083552 0.081585 -0.434589 -0.441057 0.198087
chargesum: -0.00000
title: Mulliken charges with hydrogens summed into heavy atoms:
elementType: C C C C C C C C C C C C C C C C C C O N O C Pd C C O O
charge: 0.108170 -0.028922 0.008992 0.017267 -0.063170 0.109009 -0.364434 -0.009379 0.088289 0.045852 0.016098 -0.023270 0.406779 -0.371301 0.153894 0.173895 0.048613 0.033401 -0.464722 0.141917 -0.380490 0.309582 0.398925 0.171088 0.349565 -0.434589 -0.441057
chargesum: 0.00000
polarizability: 4.28148860e+02 3.91322275e+00 4.37700993e+02 2.61339777e+01 -2.48039443e+01 4.05240172e+02
1716.lowfreq: -407.7178 -3.7148 -0.0003 0.0002 0.0007 5.4450 11.5490 23.6650 46.4200
frequency: -407.7171 22.8294 46.4026 51.6482 62.0592 68.5395 77.1973 90.8336 101.9120 110.7163 117.8545 132.9120 136.3710 157.8092 170.4729 175.3743 191.3093 200.2705 207.3865 244.5927 263.2892 268.2069 294.9762 311.1804 319.4083 350.4900 354.6683 362.2071 381.3045 390.4693 404.3801 444.0347 479.2758 498.8009 510.0267 527.7232 540.3702 544.9451 568.4014 585.1853 606.7073 616.3544 621.2300 642.5628 660.3723 693.1252 697.4707 709.5002 753.9081 755.9921 767.5021 772.8111 796.0744 807.7564 854.3868 871.8608 880.9203 892.7947 937.0322 962.6644 966.4186 968.8019 974.5810 975.2948 981.9655 987.2210 1005.2136 1005.5227 1009.0135 1013.5722 1031.2593 1036.4473 1044.7721 1058.1247 1069.1884 1079.7147 1099.4475 1110.9899 1119.2662 1138.0626 1148.7905 1150.1684 1159.7324 1161.2236 1194.4979 1205.2354 1225.5249 1243.6718 1250.3017 1255.9894 1285.6387 1298.2121 1314.5898 1321.5369 1328.7272 1339.9716 1342.3881 1345.3369 1354.0945 1386.8071 1390.7759 1400.2157 1413.7024 1418.0730 1426.5398 1433.7894 1439.7612 1443.5898 1446.5270 1454.9938 1460.9268 1465.5137 1468.3474 1492.6587 1519.1909 1521.3551 1580.2775 1605.8464 1632.2027 1637.4565 1666.7560 3007.8293 3036.6457 3057.5318 3059.4878 3064.2846 3082.6271 3114.7257 3117.7998 3125.5619 3134.3913 3147.1920 3166.9761 3171.1996 3171.7799 3171.9832 3174.3911 3180.6690 3183.4253 3194.1989 3195.5362 3202.9643 3203.7639 3522.9764
redmass: 5.3493 5.0393 1.0701 3.8613 4.9042 4.6838 4.7877 5.3714 4.6003 4.9550 4.4652 4.0785 4.3453 2.6376 2.8839 3.2281 3.2847 4.1057 2.7142 2.3359 4.1124 4.1523 5.1915 7.2902 4.3529 3.6808 3.4494 3.7218 3.0647 3.3003 4.7765 3.2199 4.0304 3.6040 2.8763 5.5260 3.8453 2.4659 2.6138 3.3116 2.5208 5.7537 6.2945 5.7002 5.5409 5.4989 3.5739 3.2331 2.2965 1.5754 2.1666 2.3950 2.5495 2.1840 1.9239 2.0181 1.3349 1.5235 2.2054 1.4745 1.6276 1.5010 2.2108 3.6114 3.5499 4.3316 1.3208 1.5136 1.3747 4.0167 4.6368 1.9375 1.3652 1.7578 2.1282 1.8924 3.6202 3.5214 1.9116 1.5132 1.4444 1.1753 1.1302 1.2979 1.7438 1.7922 1.5767 1.5260 1.5702 1.7464 1.5610 1.9975 2.0027 2.3232 3.4241 1.3183 1.5942 1.4261 1.4906 6.4587 1.0761 7.7592 1.0806 1.0445 1.1102 1.0873 1.1132 1.5611 1.4001 1.4429 1.2244 2.0574 1.1790 2.8916 7.3368 3.6721 8.0056 5.9645 6.6307 6.7401 6.8222 1.0328 1.0654 1.0631 1.0395 1.0671 1.0647 1.1018 1.1081 1.1046 1.1035 1.1037 1.0869 1.1042 1.0874 1.0893 1.1015 1.0904 1.0934 1.0961 1.0998 1.0960 1.1075 1.0782
irintensity: 644.9205 0.2377 1.3581 0.0795 0.5103 0.8780 2.9438 3.3303 3.8253 0.8170 0.5017 3.4840 2.3753 7.0359 3.5456 10.2219 1.1205 17.9991 0.1429 5.1741 8.7029 16.7123 23.5069 51.4193 30.8047 10.1394 41.1521 17.5358 8.9368 6.5197 5.1935 11.2997 59.5734 51.7563 16.2164 150.4747 4.4353 3.3997 73.0012 0.0556 13.6202 26.3586 15.9011 29.6051 48.1461 227.8955 48.5845 69.1024 41.1089 75.7069 37.6486 40.4418 5.0936 16.2261 8.9371 2.8433 3.8045 2.1069 0.6452 5.9328 15.8431 1.1624 9.9946 48.4702 30.5493 13.5275 1.2902 5.8622 5.0626 17.0041 3.2912 24.1119 1.4059 13.8634 14.9600 41.5804 41.8254 66.7944 13.3396 8.3935 3.2741 0.6786 3.5409 5.6691 15.8916 0.6144 13.9976 4.5408 36.8048 18.0071 22.7375 106.0745 35.6127 25.5892 189.6287 1.4625 6.6563 11.5248 13.7880 3.4232 77.5147 14.2234 45.8195 7.9761 13.2565 3.6015 8.4489 12.7683 11.8944 46.2610 7.0408 38.0090 105.9331 25.2390 726.7089 12.1020 285.0260 19.9390 23.2247 6.6881 3.8117 83.4521 75.7137 72.6099 3.5961 47.2820 36.9210 59.6184 51.9167 23.6775 54.4419 25.7840 2.9974 17.7755 4.6108 3.8443 2.1737 11.9582 15.9599 31.0001 39.4197 25.6779 4.1391 103.8367
temp: 298.150 k
press: 1.00000 atm
elementType: 6 6 6 6 6 1 1 1 1 6 6 6 6 6 1 6 1 1 6 6 6 6 6 6 1 1 6 1 1 1 1 1 1 1 8 7 8 6 1 1 1 46 1 6 6 1 1 8 8 1
symmnumber: 1
zpe: 1051880.1 jmol-1
zpe.correction: 0.400640 hartree
zpe.thermalcorrener: 0.425693 hartree
zpe.thermalcorrenthalpy: 0.426637 hartree
zpe.thermalcorrgfe: 0.345812 hartree
zpe.sumelectzpe: -1296.297932 hartree
zpe.sumelectthermal: -1296.272880 hartree
zpe.sumelectthermalent: -1296.271935 hartree
zpe.sumelectthermalfe: -1296.352760 hartree
dipole: -3.8087 -3.1517 3.2607
dipole: 5.9221
quadrupole: -160.8737 -148.6181 -166.0037
quadrupole: 2.6831 5.5700 1.6768
quadrupole: -2.3752 9.8804 -7.5052 2.6831 5.5700 1.6768
hfenergy: -1296.6985722 hartree
pointgroup: C01 [X(C21H23N1O4Pd1)]
dipole: -1.4872763 -1.2425444 1.2932981 debye
polarizability: 428.297395|3.8804988|437.5401041|26.1648545|-24.8127321|405.2525266 unknown
InChI: InChI=1S/C19H20NO2.C2H3O2.Pd/c1-22-20-18(21)19(13-7-8-14-19)17-12-6-5-11-16(17)15-9-3-2-4-10-15;1-2(3)4;/h2-6,9,11-12,20H,7-8,13-14H2,1H3;1H3;/q-1;-2;+3
charge 0 multiplicity 1
50 atoms
C  -1.3720404 1.62537132 -0.07994515
C  0.07601577 2.85752933 1.45472429
C  -0.30762331 4.06566073 0.87527155
C  -1.22053825 4.05647232 -0.17541305
C  -1.74873011 2.84795738 -0.63902344
H  0.80096193 2.84539633 2.27356448
H  0.10657436 5.00725892 1.24314027
H  -1.53418491 4.99402282 -0.64094532
H  -2.48052308 2.87977082 -1.44813832
C  -0.05479184 0.36025299 1.59552886
C  0.20732237 -0.736538 0.74521893
C  -0.01494842 0.16456814 2.98198942
C  0.43901808 -2.01239815 1.27883833
C  0.25855971 -1.09928191 3.50493677
H  -0.22400296 1.00326427 3.65215808
C  0.47317479 -2.19354404 2.65845904
H  0.58785278 -2.8597609 0.60196498
H  0.28351228 -1.23976234 4.58835973
C  -0.43704618 1.64372298 0.98406582
C  -0.87296332 -0.65775668 -0.93354113
C  -2.00217242 0.28675212 -0.47830968
C  -2.99352275 0.41100092 -1.66360729
C  -2.89676948 -0.21794183 0.70418087
C  -4.34133206 0.66559895 -1.0096318
H  -3.0342297 -0.5472095 -2.20089482
H  -2.6817198 1.16250599 -2.40098732
C  -4.32658612 -0.29664757 0.16975628
H  -2.84429726 0.51183609 1.52642463
H  -2.54052226 -1.16694712 1.1292189
H  -4.404033 1.70790583 -0.65218915
H  -5.18735692 0.51162102 -1.69564697
H  -5.07466251 -0.05573541 0.93907364
H  -4.54547166 -1.3152698 -0.1853931
H  0.66502685 -3.18346396 3.07957838
O  -0.00555438 -0.14224822 -1.7672069
N  -1.15648572 -1.99837121 -1.23936535
O  -2.44484656 -2.47258019 -0.98162489
C  -2.41004889 -3.59390892 -0.11769107
H  -1.79455266 -4.40826122 -0.53167584
H  -2.03927008 -3.33669056 0.88818476
H  -3.44795586 -3.9402998 -0.03560075
Pd 1.66046947 -0.24641847 -0.64958429
H  6.07128748 -0.82689266 -0.83680403
C  5.63223461 0.14324022 -0.56267178
C  4.14988358 0.03501667 -0.62089082
H  6.00110597 0.88737366 -1.27789139
H  5.97343734 0.39001257 0.44908264
O  3.52262911 0.24136868 -1.70232046
O  3.49102349 -0.30067694 0.41740756
H  -0.8795881 -2.22862669 -2.19506411
