program: Gaussian 09
title: 000006980
version: EM64L-G09RevD.01
frameworkgroup: C1[X(C6H4ClNO3)]
method: RPBEPBE
basis: SDD
operation: Freq
keyword: #p
keyword: freq=noraman
keyword: PBEPBE/SDD
title: #p freq=noraman PBEPBE/SDD
converged: NO NO NO NO
title: Mulliken charges:
elementType: Cl O O O N C C C C C C H H H H
charge: -0.025784 -0.373450 -0.178809 -0.265110 0.031081 0.298935 0.150113 -0.306139 -0.282405 -0.095621 -0.180235 0.310102 0.274068 0.269129 0.374124
chargesum: 0.00000
title: Mulliken charges with hydrogens summed into heavy atoms:
elementType: Cl O O O N C C C C C C
charge: -0.025784 0.000674 -0.178809 -0.265110 0.031081 0.298935 0.150113 0.003964 -0.008338 -0.095621 0.088894
polarizability: 1.42994263e+02 -1.97285880e+00 1.14031174e+02 8.16348601e-03 1.45156665e-02 3.43230968e+01
1716.lowfreq: -12.3771 -0.0015 0.0014 0.0017 3.2364 9.9143 79.5588 135.1313 152.9753
frequency: 79.5412 135.1308 152.9691 178.1379 314.5334 320.8886 349.2774 375.6244 420.5043 424.6065 522.8414 540.8910 631.6647 659.9851 678.3103 711.6100 769.9921 821.2155 842.2175 854.2913 899.6114 962.7766 1058.2702 1074.3440 1138.4631 1161.0029 1216.5392 1257.3839 1306.1505 1357.5357 1415.2242 1440.3497 1483.6878 1572.7478 1618.6328 3001.8906 3169.6452 3189.1477 3191.4259
redmass: 11.1876 10.2307 5.8436 16.2789 6.5823 7.0709 16.9502 7.7526 9.7795 3.7842 3.5567 5.6441 8.1122 5.7316 9.7610 6.5022 7.8747 1.3762 1.1093 7.6779 1.3810 1.3344 2.0391 4.3450 1.5634 5.8525 1.4280 2.9264 2.0503 6.2380 7.3180 2.2866 3.6907 5.0985 6.7304 1.0654 1.0894 1.0960 1.0946
irintensity: 0.0006 0.9657 0.8371 2.0379 8.6919 0.5594 1.0651 8.6273 2.2382 0.5010 26.3729 9.4269 24.8322 0.2331 22.3574 3.2551 11.7040 133.4272 57.5736 16.8864 21.8264 0.8684 0.2696 1.5319 10.4839 343.0467 81.0069 168.0592 71.2186 123.4257 5.3769 112.5434 111.8319 39.3029 17.9726 147.5821 0.2375 0.7248 9.7409
temp: 298.150 k
press: 1.00000 atm
elementType: 17 8 8 8 7 6 6 6 6 6 6 1 1 1 1
symmnumber: 1
zpe: 247023.2 jmol-1
zpe.correction: 0.094086 hartree
zpe.thermalcorrener: 0.103132 hartree
zpe.thermalcorrenthalpy: 0.104076 hartree
zpe.thermalcorrgfe: 0.059119 hartree
zpe.sumelectzpe: -970.649331 hartree
zpe.sumelectthermal: -970.640285 hartree
zpe.sumelectthermalent: -970.639341 hartree
zpe.sumelectthermalfe: -970.684298 hartree
dipole: -2.1936 2.3798 0.0059
dipole: 3.2366
quadrupole: -78.0252 -71.0438 -70.1913
quadrupole: 0.2389 -0.0020 0.0151
quadrupole: -4.9384 2.0430 2.8955 0.2389 -0.0020 0.0151
hfenergy: -970.7434171 hartree
pointgroup: C01 [X(C6H4Cl1N1O3)]
dipole: 1.0144669 0.7695902 -0.0078556 debye
dipolederiv: -0.6183102 0.2458151 0.0139712 0.364844 -0.2523246 -0.0096743 0.0160249 -0.00772 -0.0470761 -0.8811098 0.5449374 0.0187306 0.3150955 -0.6938628 -0.0105802 0.0150939 -0.0160518 -0.371422 -0.449608 -0.0953204 0.0025358 -0.2949689 -0.9427122 -0.0058761 -0.0006663 -0.0091736 -0.2099992 -0.9334798 0.0836536 0.0120598 0.2668418 -0.4924132 -0.0073884 0.0151672 -0.0041537 -0.2731234 1.6483279 0.410116 -0.0171292 0.40832 1.329884 0.0091233 -0.0170981 0.0090378 0.2138252 -0.7385739 -0.5108346 0.0048885 -0.2563898 -0.3589866 -0.0013765 0.0089338 0.0027535 0.0125286 0.8517994 -0.6635287 -0.0245661 -0.0966975 0.5223558 0.0083379 -0.015807 0.018782 0.1338163 0.1149282 0.4109886 0.0036936 -0.0557339 -0.1472306 -0.000765 -0.0034592 -0.0090992 -0.0419159 -0.2814666 0.3483668 0.0079557 -0.0032804 0.1051689 0.0039252 0.0020905 -0.0020635 -0.1630036 0.7357488 -0.7000097 -0.0257918 -0.8178055 0.0570213 0.0167004 -0.0273351 0.0149596 -0.0923835 -0.0559924 0.0126482 -0.0002467 0.2770123 0.2817759 0.0006644 0.0037813 0.005077 -0.0547393 0.1279245 -0.034029 0.0004306 0.0281625 0.0886652 -0.0019645 0.0011958 -0.0006475 0.1800146 0.0805777 0.022088 0.0021032 -0.0092827 -0.0091766 -0.0025833 0.0018299 -0.0030941 0.1751745 0.0071782 -0.0556992 0.0020409 -0.0376616 0.0974886 -0.0002564 0.0023028 0.0000389 0.1607121 0.392056 -0.0191922 -0.0006761 -0.0884558 0.4143468 0.0017135 -0.0020543 0.0013548 0.3775917 unknown
polarizability: 142.7444911|-3.1478659|114.2254644|-1.959021|1.3230924|34.378579 unknown
InChI: InChI=1S/C6H4ClNO3/c7-4-1-2-6(9)5(3-4)8(10)11/h1-3,9H
charge 0 multiplicity 1
15 atoms
Cl 3.435244 -1.388338 -0.059877
O  -1.498322 2.054981 0.084511
O  -1.854057 -2.147765 0.022739
O  -2.863766 -0.105151 0.069189
N  -1.784409 -0.868075 0.040257
C  -0.487326 -0.205026 0.029245
C  -0.406799 1.228429 0.050702
C  0.678505 -1.014982 -0.005251
C  0.884015 1.823704 0.036456
C  1.922236 -0.384463 -0.017128
C  2.039253 1.031042 0.002982
H  0.571138 -2.10194 -0.020717
H  0.944703 2.914821 0.051414
H  3.028199 1.49779 -0.008753
H  -2.331015 1.461174 0.086731
