program: Gaussian 16
title: Geometry optimization calculation of filename
version: ES64L-G16RevC.01
frameworkgroup: C1[X(C22H33Br2N3Si)]
method: RB3LYP
basis: 6-311+G(d,p)
operation: Freq
keyword: #P
keyword: Geom=AllCheck
keyword: Guess=TCheck
keyword: SCRF=Check
keyword: GenChk
keyword: RB3LYP/6-311+G(d,p)
keyword: Freq
converged: YES YES NO YES
title: Mulliken charges:
elementType: C C C C N C C C N N C C C C H H H H H H H H H H H H Br C C Si C H C H C H C H H H C H H H C H H H C H H H C H H H C H H H Br
charge: -0.466130 0.527003 0.753000 -0.871922 -0.279055 -0.069226 0.026808 0.060000 0.001588 -0.018403 -0.253469 -0.283575 -0.270624 -0.254214 0.175051 0.160193 0.143042 0.180024 0.155057 0.164369 0.167237 0.144687 0.168123 0.185871 0.157359 0.148680 -0.173431 0.186567 -0.503055 1.153357 -0.298967 0.170065 -0.117683 0.153733 -0.190268 0.163071 -0.476135 0.141733 0.135664 0.132787 -0.571983 0.139446 0.152848 0.130197 -0.598804 0.138436 0.140435 0.139027 -0.570415 0.137212 0.149047 0.134047 -0.667983 0.132858 0.132947 0.174452 -0.626313 0.136787 0.133376 0.168584 -0.133116
chargesum: -0.00000
title: Mulliken charges with hydrogens summed into heavy atoms:
elementType: C C C C N C C C N N C C C C Br C C Si C C C C C C C C C Br
charge: -0.466130 0.527003 0.753000 -0.871922 -0.279055 -0.069226 0.026808 0.060000 0.001588 -0.018403 0.224817 0.215876 0.209423 0.237696 -0.173431 0.186567 -0.503055 1.153357 -0.128902 0.036050 -0.027197 -0.065950 -0.149492 -0.180906 -0.150109 -0.227725 -0.187566 -0.133116
polarizability: 5.30579403e+02 1.35634697e+01 4.18640453e+02 3.14009137e+00 -1.00735898e+00 2.52119602e+02
1716.lowfreq: -1.8520 0.0028 0.0062 0.0094 1.5782 2.1005 10.1469 14.8352 22.9621
frequency: 9.4587 14.7884 22.9607 33.6109 34.8037 43.3041 46.6832 52.7453 62.6171 65.0925 71.2757 82.4021 84.1379 93.7738 102.4445 112.1628 120.4414 132.3185 137.8780 145.5931 153.0858 165.0893 189.3272 195.4102 205.6401 207.3311 213.0355 218.0527 222.0979 227.7969 243.0178 244.2518 251.9652 252.5423 260.7520 273.6588 275.3662 281.3935 291.0905 300.5333 306.0852 321.1942 339.2214 349.4329 367.1598 396.9035 405.4207 418.3424 421.2264 447.8587 480.0136 489.0198 493.3188 532.8595 569.6253 595.2896 600.4381 635.1868 654.4043 661.2900 668.0385 732.9833 744.9333 765.5976 779.0118 784.5822 871.1207 884.3596 885.5143 888.7683 926.0058 929.0841 931.5674 949.0676 978.3456 979.0646 981.7605 1012.8797 1026.1530 1031.4640 1035.3829 1072.1186 1075.4938 1079.7274 1085.2110 1087.8906 1096.7934 1119.1170 1120.3314 1159.7962 1168.1891 1181.7220 1182.7691 1184.2713 1184.9359 1217.2184 1230.3901 1236.2824 1265.5204 1272.5001 1276.5088 1280.7200 1322.1966 1325.8360 1328.2386 1334.8237 1347.9749 1371.7875 1389.8064 1397.9844 1399.1379 1403.5557 1417.8574 1421.8845 1424.6457 1437.3690 1441.0186 1455.5256 1464.9976 1472.0120 1481.8544 1482.5543 1485.1764 1486.9007 1487.4775 1489.3386 1491.1605 1496.2008 1497.9161 1501.1287 1501.6698 1502.6051 1503.6383 1504.8933 1506.0317 1508.1086 1511.2410 1513.0205 1514.1192 1515.0409 1520.7159 1602.9072 1647.2487 2214.3751 2974.6652 2979.4493 2998.2275 3006.3097 3007.9084 3008.3843 3010.5937 3010.9927 3012.9381 3017.2860 3017.7693 3023.0023 3026.1827 3057.0120 3060.9778 3063.8221 3067.3389 3068.1406 3068.4617 3070.5934 3072.6636 3074.0061 3078.9545 3080.0776 3089.8518 3091.8289 3092.4916 3097.5037 3108.6531 3172.7172 3177.9292 3184.8292 3190.0235
redmass: 4.2295 4.2217 3.6115 5.5455 3.2846 4.6077 2.8428 2.7697 1.5225 3.6787 2.3882 2.2360 2.0870 2.7988 2.4294 1.2694 9.4772 1.4262 3.0757 2.7936 2.6481 5.3475 2.4473 1.8722 3.8941 2.4286 1.0903 1.1691 1.6663 2.5766 1.7536 1.5150 3.5423 1.6190 3.2284 2.7520 2.3037 3.9008 1.8084 3.7194 3.4870 3.7668 2.8130 4.1290 2.9884 3.1872 3.4066 2.7396 2.6910 3.0841 4.1295 4.9502 6.3328 3.9923 4.0771 8.8690 5.7490 4.4580 8.2404 4.6758 9.0961 11.8598 11.6651 10.3451 8.5387 10.5793 6.6490 2.5383 2.5246 2.5360 1.1524 1.1587 1.1558 3.4571 1.4836 1.4171 1.4534 1.1744 1.2592 3.2926 1.2870 1.6645 1.4884 2.3822 2.5272 3.1133 2.5687 1.2260 1.2276 1.5850 1.4194 1.9900 2.7095 1.8829 1.9264 5.2499 2.8658 2.7689 1.5137 1.4535 1.4660 5.0968 1.2762 1.2794 9.3583 1.2725 7.5600 8.8028 9.0838 1.2017 1.1999 1.2004 1.2053 1.2025 1.2023 1.2141 1.2070 1.3591 1.2382 4.5634 1.0657 1.0855 1.0654 1.0460 1.0654 1.0436 1.0434 1.0424 1.0483 1.0489 1.3379 1.0631 1.1523 1.0475 1.0786 1.0476 1.0465 1.0512 1.0459 1.0455 3.0148 3.0562 4.7452 12.0021 1.0810 1.0813 1.0798 1.0404 1.0388 1.0399 1.0430 1.0406 1.0419 1.0406 1.0424 1.0411 1.0406 1.0984 1.0978 1.0962 1.0945 1.0935 1.1029 1.0948 1.1014 1.1028 1.0994 1.1006 1.1020 1.1012 1.1008 1.0979 1.0967 1.0975 1.0968 1.0961 1.0958
irintensity: 0.2100 0.1284 0.2577 0.0210 0.2256 0.2578 0.0012 0.6069 1.2180 0.1141 0.3418 0.7882 1.0259 0.6028 2.5024 0.7377 0.0623 0.8915 0.2570 0.0701 0.0266 0.3169 2.7192 0.3946 2.4548 0.1094 0.0745 0.0426 1.1844 1.3436 0.1247 0.7021 2.5324 0.2856 3.5550 0.3102 0.6317 3.7993 2.4600 1.3602 1.1669 1.4484 2.5431 4.8749 3.4831 5.6210 5.3735 3.2655 1.9849 14.5839 24.0911 16.7381 6.5266 1.7521 1.9677 7.5858 74.7431 63.0516 8.7903 60.9274 5.5408 19.5437 3.9703 21.4531 90.3973 1.2371 107.8991 10.0357 22.7953 13.9700 3.1178 5.8268 2.9297 44.4284 0.2098 0.5216 0.1774 17.0762 17.1891 11.7336 25.3646 0.8775 11.2317 11.0202 4.8425 23.6802 5.6753 1.3363 3.3283 0.9858 3.8249 6.9984 22.2312 0.3501 0.4611 19.5429 83.8111 12.3547 0.6126 23.6081 4.2738 6.2083 1.0104 0.3405 233.4507 0.4740 289.7796 116.8830 101.1298 1.0332 0.8861 1.8101 2.7590 4.6732 0.7589 28.8483 29.6277 176.7287 74.1742 97.5530 9.4579 35.6626 2.3688 2.3581 39.6769 0.7033 2.5481 3.2783 3.5709 1.7988 23.2376 21.6280 12.2005 2.5356 1.4642 10.9071 7.9356 2.1262 4.7490 13.8277 272.4549 877.6008 561.3687 221.1067 14.9251 27.8955 11.6317 19.4161 42.1980 24.6658 96.7139 99.1123 23.3786 6.6853 53.3827 129.4847 111.9265 39.7973 25.5988 23.4429 43.6494 39.4091 25.6625 59.5418 12.8322 32.1247 14.7758 32.3577 18.1744 40.1320 17.7203 41.6893 15.2047 1.6507 2.6479 1.5622 3.3008
temp: 298.150 k
press: 1.00000 atm
elementType: 6 6 6 6 7 6 6 6 7 7 6 6 6 6 1 1 1 1 1 1 1 1 1 1 1 1 35 6 6 14 6 1 6 1 6 1 6 1 1 1 6 1 1 1 6 1 1 1 6 1 1 1 6 1 1 1 6 1 1 1 35
symmnumber: 1
zpe: 1328877.5 jmol-1
zpe.correction: 0.506143 hartree
zpe.thermalcorrener: 0.542086 hartree
zpe.thermalcorrenthalpy: 0.543030 hartree
zpe.thermalcorrgfe: 0.433599 hartree
zpe.sumelectzpe: -6459.986808 hartree
zpe.sumelectthermal: -6459.950864 hartree
zpe.sumelectthermalent: -6459.949920 hartree
zpe.sumelectthermalfe: -6460.059351 hartree
dipole: 2.0894 5.8361 -0.0805
dipole: 6.1994
quadrupole: -172.9567 -194.7198 -209.3055
quadrupole: 10.1836 -1.1370 0.3377
quadrupole: 19.3706 -2.3925 -16.9782 10.1836 -1.1370 0.3377
hfenergy: -6460.4929503 hartree
pointgroup: C01 [X(C22H33Br2N3Si1)]
dipole: 0.007382 1.9438619 1.4731706 debye
polarizability: 371.8754167|-101.2279513|455.5312135|84.1546847|14.9050484|373.9328276 unknown
InChI: InChI=1S/C22H33Br2N3Si/c1-13(2)28(14(3)4,15(5)6)12-11-16-17-18(20(24)19(16)23)22(27(9)10)25-21(17)26(7)8/h13-15H,1-10H3
charge 0 multiplicity 1
61 atoms
C  7.00733407 0.5969276 5.51774353
C  7.22947605 -0.76813432 5.06622424
C  8.20327535 -1.30085169 5.95777377
C  8.51649645 -0.21100633 6.86654256
N  7.80718523 0.90862265 6.56539167
C  7.04135806 -1.70770205 4.02809436
C  7.86502914 -2.80973034 4.30056357
C  8.61509224 -2.58031814 5.49067673
N  6.14619118 1.51797301 5.06684817
N  9.35291304 -0.18329479 7.90959394
C  5.00131304 1.2101442 4.22039096
C  6.18638833 2.88461883 5.58342434
C  9.98968003 -1.36634146 8.46799597
C  9.59280544 1.0540465 8.64873193
H  5.12835118 1.62343418 3.2157561
H  4.85911018 0.13800923 4.14583777
H  4.10640654 1.6516399 4.66975306
H  7.16562935 3.08851141 6.0047955
H  5.98069794 3.57452803 4.76119015
H  5.4276994 3.02726401 6.36094958
H  11.07640843 -1.3047916 8.35575017
H  9.75453829 -1.42896905 9.53542496
H  9.63935991 -2.26627261 7.97633476
H  9.20448903 1.89608707 8.08546323
H  9.09834108 1.01398285 9.62538904
H  10.66856752 1.1699135 8.80740876
Br 7.98494653 -4.38173289 3.25260509
C  9.57047707 -3.4891069 5.98801797
C  10.38785096 -4.30967914 6.37028024
Si 11.63179917 -5.58006801 6.85991477
C  13.34758203 -4.72732104 7.0516919
H  14.07593567 -5.5298121 6.86492557
C  11.70862138 -6.91487274 5.48451265
H  12.40814461 -7.67105743 5.87040486
C  10.99294574 -6.43549331 8.45559247
H  10.08778838 -6.94978488 8.10667682
C  13.64047165 -4.16201548 8.45464902
H  13.59850633 -4.92494043 9.23448892
H  14.64266601 -3.71835453 8.48404038
H  12.93179556 -3.37225887 8.72433951
C  13.58513358 -3.62533021 5.9990161
H  13.44654571 -3.97680044 4.97548573
H  12.89502058 -2.78976304 6.14706764
H  14.60594698 -3.23368988 6.08055502
C  11.95077077 -7.51812703 8.99091518
H  11.49564046 -8.05488833 9.83128014
H  12.20250697 -8.26227045 8.22989881
H  12.88968022 -7.08957545 9.35526361
C  10.54313499 -5.48359451 9.57915124
H  11.38350673 -4.94260296 10.02171092
H  9.82219877 -4.74696823 9.21518434
H  10.06022289 -6.04651552 10.38659454
C  10.34812282 -7.60504489 5.26340718
H  10.43682406 -8.38808162 4.50155792
H  9.96523693 -8.0784743 6.17129434
H  9.59508043 -6.89184866 4.91624748
C  12.2715978 -6.41363968 4.1414261
H  13.29797381 -6.04987565 4.23138752
H  12.27925961 -7.22637676 3.40590651
H  11.66039332 -5.60598732 3.7278595
Br 5.98979605 -1.5859922 2.45230521
