program: Gaussian 16
title: Geometry optimization calculation of filename
version: ES64L-G16RevC.01
frameworkgroup: C1[X(C17H19N3)]
method: RB3LYP
basis: 6-311+G(d,p)
operation: Freq
keyword: #P
keyword: Geom=AllCheck
keyword: Guess=TCheck
keyword: SCRF=Check
keyword: GenChk
keyword: RB3LYP/6-311+G(d,p)
keyword: Freq
converged: YES YES YES YES
title: Mulliken charges:
elementType: C C C C N C C C N N C C C C H H H H H H H H H H H H H H C C C C H C H C H H H
charge: -0.146193 0.466260 0.647542 -0.148570 -0.322106 -0.421720 -0.301991 -0.685167 -0.055756 -0.055483 -0.204351 -0.307652 -0.201399 -0.309312 0.101206 0.104191 0.173779 0.159682 0.146323 0.187976 0.152379 0.147024 0.175085 0.145351 0.156910 0.188039 0.147009 0.153066 1.251486 -0.331423 -0.357217 -0.530710 0.110048 -0.491775 0.111495 -0.202384 0.115950 0.115854 0.116553
chargesum: -0.00000
title: Mulliken charges with hydrogens summed into heavy atoms:
elementType: C C C C N C C C N N C C C C C C C C C C
charge: -0.146193 0.466260 0.647542 -0.148570 -0.322106 -0.320514 -0.301991 -0.580976 -0.055756 -0.055483 0.275433 0.179728 0.275947 0.178801 1.251486 -0.221375 -0.245722 -0.414760 -0.375921 -0.085830
polarizability: 3.83249668e+02 -2.49665388e-01 2.72864668e+02 3.38696334e-01 -7.11635634e+00 1.33898582e+02
1716.lowfreq: -3.4119 -1.4507 -0.0007 -0.0004 -0.0003 2.2589 35.1332 43.6721 67.3367
frequency: 35.1301 43.6720 67.3366 71.9916 84.0434 96.2123 98.1965 104.8429 109.5766 132.8197 167.4949 168.0862 200.1179 222.1721 253.8288 265.0655 286.0946 305.9993 330.0947 333.2016 389.3889 414.5362 453.9701 464.0064 513.5071 558.7880 561.4473 606.3318 630.1829 638.9376 664.8556 703.8851 735.5082 740.9523 745.5308 766.0264 782.2977 802.3738 827.2924 831.6339 846.9021 914.9074 922.0460 956.9778 977.2677 992.3113 1011.9405 1034.4542 1044.5931 1062.1302 1074.6200 1079.0891 1091.4043 1114.2801 1118.6108 1123.8632 1161.3533 1163.8974 1168.5928 1178.4123 1202.7933 1204.1327 1227.0034 1245.6878 1253.0565 1280.6483 1311.6647 1347.8634 1361.9476 1372.0964 1388.1644 1434.9414 1438.4092 1449.1788 1458.6619 1463.2018 1483.6331 1484.9297 1490.9881 1491.4520 1494.9985 1495.9989 1499.6891 1500.4630 1506.6662 1508.6945 1538.8527 1549.7027 1595.4830 1608.2288 1635.4082 1652.4471 3011.2520 3011.6613 3016.3354 3017.2258 3064.2934 3064.5805 3091.0049 3091.1157 3130.5010 3131.0631 3152.0577 3158.2394 3167.4905 3168.5783 3171.9292 3176.0024 3185.1963 3216.3573 3217.8137
redmass: 3.5842 4.1727 3.2942 1.8955 2.5792 1.4419 1.3372 1.5078 1.8599 1.6172 2.0767 2.5643 3.0446 4.1600 3.0947 5.0009 4.0285 4.8771 3.7489 2.8153 2.9898 2.9226 3.7899 4.2048 3.3528 3.9184 3.4990 7.6860 3.5197 3.2833 7.2890 1.8606 4.8199 11.3792 4.9430 1.7500 5.5490 1.6862 2.6123 2.7063 1.2558 1.4971 5.8214 3.2173 1.3723 1.2716 5.9380 2.5584 2.6914 1.6766 1.5620 1.4807 2.0063 1.7574 1.2338 1.8787 1.8516 1.3768 1.7407 1.1042 1.1462 1.5107 3.7419 2.0495 2.1505 4.6986 3.7488 2.4240 6.3648 2.5903 7.2229 1.2013 1.1684 1.4374 1.2445 2.6513 2.5671 1.4866 1.1009 1.1125 1.4390 1.0996 1.2325 1.0703 1.0965 1.0624 3.0066 5.8963 3.0366 5.3566 5.3254 5.4978 1.0420 1.0416 1.0448 1.0447 1.1020 1.1020 1.0892 1.0893 1.1038 1.1037 1.0844 1.0872 1.0968 1.0965 1.0904 1.0935 1.0977 1.0925 1.0942
irintensity: 0.3050 1.9349 0.2889 3.5031 0.1538 1.1668 0.0947 1.1704 1.0273 2.7063 2.0535 0.1963 1.5729 1.7880 1.1192 0.0708 1.2122 0.4950 0.6010 0.1647 4.3235 0.0015 1.6584 11.8956 10.4975 1.9564 1.4017 1.8588 2.4949 2.2187 25.0357 34.2482 3.4616 15.6614 1.0263 67.9798 0.7789 2.7544 8.3772 11.2466 0.1087 2.1057 52.1338 21.2579 0.0009 0.0519 3.1011 58.4075 0.2737 20.7754 62.4132 2.1263 7.6650 9.5212 0.0697 0.0630 9.4422 26.6496 3.0240 0.0304 1.7498 10.0638 3.7453 132.8075 115.4803 41.0174 3.8493 59.6114 132.9971 151.8036 11.0407 36.9773 0.4134 139.0998 62.9888 17.6160 55.0683 5.2158 54.1896 2.1767 27.1660 23.1180 57.2192 2.7893 1.4882 9.6203 8.1918 503.9197 949.8832 2.8362 350.1656 392.8615 20.0572 35.7134 160.2152 77.7374 5.3389 58.8536 23.4162 28.7891 6.4601 6.2019 11.2419 4.9491 0.3859 3.0253 18.2017 33.8215 19.7294 11.6339 1.8712
temp: 298.150 k
press: 1.00000 atm
elementType: 6 6 6 6 7 6 6 6 7 7 6 6 6 6 1 1 1 1 1 1 1 1 1 1 1 1 1 1 6 6 6 6 1 6 1 6 1 1 1
symmnumber: 1
zpe: 852129.1 jmol-1
zpe.correction: 0.324559 hartree
zpe.thermalcorrener: 0.343876 hartree
zpe.thermalcorrenthalpy: 0.344820 hartree
zpe.thermalcorrgfe: 0.275952 hartree
zpe.sumelectzpe: -823.358500 hartree
zpe.sumelectthermal: -823.339183 hartree
zpe.sumelectthermalent: -823.338239 hartree
zpe.sumelectthermalfe: -823.407106 hartree
dipole: 4.9054 -0.0040 0.2142
dipole: 4.9101
quadrupole: -113.7759 -91.6313 -125.5689
quadrupole: -0.1105 0.5959 -1.3123
quadrupole: -3.4505 18.6941 -15.2436 -0.1105 0.5959 -1.3123
hfenergy: -823.6830586 hartree
pointgroup: C01 [X(C17H19N3)]
dipole: -0.0516617 -1.9309829 0.0213246 debye
polarizability: 258.8170867|0.3433019|383.0670922|42.5394951|6.2308428|148.1287394 unknown
InChI: InChI=1S/C17H19N3/c1-19(2)16-14-10-13(12-8-6-5-7-9-12)11-15(14)17(18-16)20(3)4/h5-11H,1-4H3
charge 0 multiplicity 1
39 atoms
C  -1.02519601 -0.35952656 -0.48197086
C  -0.65476641 1.02550974 -0.32563308
C  0.6437328 0.99774453 0.2502835
C  0.95592993 -0.40195099 0.40356094
N  -0.05626801 -1.20434544 -0.03020674
C  -1.06178243 2.3660727 -0.43408407
C  -0.00425702 3.17503148 0.06378539
C  1.04780172 2.32115238 0.49418
N  -2.1621695 -0.84019476 -1.0025359
N  2.08493292 -0.93102148 0.89359745
C  -3.20187786 0.06156696 -1.47768652
C  -2.46372813 -2.26735822 -0.99811625
C  3.16215428 -0.07448716 1.36899017
C  2.23397721 -2.36828514 1.09309921
H  -1.99093174 2.74587836 -0.83358834
H  1.9596154 2.65921269 0.9648887
H  -3.84353372 0.4050212 -0.6579207
H  -2.75322984 0.92777632 -1.96281171
H  -3.81940842 -0.46456145 -2.20705144
H  -1.59758996 -2.80777207 -0.6278032
H  -3.32496877 -2.47148683 -0.35232744
H  -2.70095375 -2.60084161 -2.01280082
H  2.98934279 0.25676051 2.39950294
H  4.09872485 -0.63282035 1.33424568
H  3.25536598 0.80090211 0.72705986
H  1.36292162 -2.87144978 0.68388996
H  3.13695056 -2.72269185 0.58701571
H  2.31903682 -2.59650191 2.16131515
C  -0.00227679 4.64233797 0.13329821
C  1.19941517 5.37402203 0.11678789
C  -1.20112252 5.37388615 0.22003585
C  1.20294864 6.76374008 0.19056518
H  2.14110263 4.84479248 0.02327215
C  -1.19889464 6.76409074 0.28106493
H  -2.14529373 4.84246935 0.26149438
C  0.00350456 7.47089894 0.27011907
H  2.14703545 7.29823626 0.17292759
H  -2.14081601 7.29824401 0.35008642
H  0.00561452 8.55376755 0.3224029
