program: Gaussian 16
title: SINGLE POINT - PBEPBE-GD3MBJ-SMDwater_def2-QZVP-QZVPD-SDD
version: ES64L-G16RevC.01
method: RPBEPBE
basis: GenECP
operation: SP
keyword: #P
keyword: #
keyword: PBEPBE/GENECP
keyword: 5D
keyword: 7F
keyword: GEOM=CHECK
keyword: GUESS=READ
keyword: NOSYMM
keyword: GFINPUT
keyword: #INT=ULTRAFINE
keyword: EMPIRICALDISPERSION=GD3BJ
keyword: IOP(3/174=1000000,3/175=358940,3/177=12092,3/178=5938951)
keyword: SCRF=(SMD,SOLVENT=WATER)
keyword: SCF=(VSHIFT=300,NOSYM,NOVARACC,MAXCYCLE=200,CONVER=5)
keyword: SP
title: #P # PBEPBE/GENECP 5D 7F # GEOM=CHECK # GUESS=READ # NOSYMM # GFINPUT
basis: NPDir=0 NMtPBC= 1 NCelOv= 1 NCel= 1 NClECP= 1 NCelD= 1
basis: NCelK= 1 NCelE2= 1 NClLst= 1 CellRange= 0.0.
basis: One-electron integrals computed using PRISM.
title: Mulliken charges:
elementType: Zr O O O O O O N N N N C C C C C C C C C C C C C C C H H H H H H H H H H H H H H H H H H H H H H H H C O O
charge: 1.870412 -0.703359 -0.703481 -0.693295 -0.786875 -0.703353 -0.703472 0.173634 0.142160 0.173632 0.142163 0.035683 0.019422 0.077908 0.096820 0.035692 0.019413 0.077913 0.096818 -0.007370 0.402893 0.024206 0.404145 -0.007349 0.402870 0.024196 0.039234 0.043482 0.055844 0.047537 0.044196 0.034641 0.053380 0.040954 0.039231 0.043485 0.055846 0.047537 0.057426 0.050910 0.044197 0.034643 0.048296 0.066390 0.053378 0.040958 0.057425 0.050913 0.066386 0.048293 0.404156 -0.786864 -0.693298
chargesum: -0.00000
dipole: -0.0026 -0.0017 32.6792
dipole: 32.6792
quadrupole: -211.0265 -226.0741 -206.9204
quadrupole: -15.0317 0.0007 -0.0008
quadrupole: 3.6472 -11.4005 7.7533 -15.0317 0.0007 -0.0008
hfenergy: -1491.4161424 hartree
pointgroup: C01 [X(C16H24N4O8Zr1)]
dipole: -0.00103 -0.0006641 12.8569967 debye
InChI: InChI=1S/C16H24N4O8.Zr/c21-13(22)9-17-1-2-18(10-14(23)24)5-6-20(12-16(27)28)8-7-19(4-3-17)11-15(25)26;/h1-12H2;/q-4;+4
charge 0 multiplicity 1
53 atoms
Zr 0.00006826 0.00009234 -0.49013729
O  1.30908164 1.60853813 -1.18563649
O  2.05667002 3.72040569 -1.05854349
O  3.4002117 -1.5984345 -2.55591882
O  1.34682608 -1.20781864 -1.73573045
O  -1.30879174 -1.60826945 -1.18588183
O  -2.05620708 -3.72022238 -1.05926759
N  -2.22547167 0.31786473 0.61340822
N  0.25609736 1.68036666 1.35232174
N  2.22551264 -0.3178058 0.61366068
N  -0.25613931 -1.68037204 1.35215905
C  -2.21654689 1.63736396 1.30749957
C  -0.98859644 1.86649343 2.15289019
C  1.38603176 1.36119363 2.26351342
C  2.58044418 0.81119392 1.51598514
C  2.21650423 -1.63735955 1.30764549
C  0.98845184 -1.866547 2.15287106
C  -1.38618748 -1.36126654 2.26323056
C  -2.58050598 -0.81121596 1.51559349
C  0.53144845 2.94807687 0.62192349
C  1.38698102 2.77123608 -0.61594363
C  3.22087405 -0.41548341 -0.47745108
C  2.64636941 -1.14068954 -1.68118198
C  -0.53138376 -2.9480261 0.62161998
C  -1.3866863 -2.7710651 -0.61639021
C  -3.22072655 0.41563357 -0.47779531
H  -3.12128906 1.73506457 1.93085166
H  -2.27602019 2.40943712 0.52809041
H  -1.01964981 2.88769523 2.56702756
H  -0.95647458 1.18600077 3.00798496
H  1.0184748 0.64897545 3.00692997
H  1.6903005 2.26931734 2.81155417
H  3.03261161 1.59973714 0.90175466
H  3.34815224 0.49405194 2.24088838
H  3.12117046 -1.73510837 1.93110081
H  2.27607189 -2.40937382 0.52818619
H  1.01945575 -2.88777251 2.56695333
H  0.95622517 -1.1861052 3.00800088
H  -0.97455242 -3.69033279 1.30265268
H  0.42338945 -3.35744234 0.25796843
H  -1.01872846 -0.64909611 3.00674159
H  -1.69052343 -2.2694283 2.81117131
H  -3.48816159 -0.59317183 -0.81905901
H  -4.14288512 0.91127047 -0.13575981
H  -3.03258019 -1.59971123 0.90123301
H  -3.34831532 -0.49414133 2.24041827
H  0.97446368 3.69034738 1.30309533
H  -0.42326842 3.35748992 0.25811724
H  4.14299319 -0.91116698 -0.13537479
H  3.48835689 0.59335097 -0.81859053
C  -2.64611107 1.14096086 -1.6813973
O  -1.34656339 1.2080595 -1.73583241
O  -3.399872 1.59880917 -2.55615084
