program: Gaussian 16
title: SINGLE POINT - PBEPBE-GD3MBJ-SMDwater_def2-QZVP-QZVPD-SDD
version: ES64L-G16RevC.01
method: RPBEPBE
basis: GenECP
operation: SP
keyword: #P
keyword: #
keyword: PBEPBE/GENECP
keyword: 5D
keyword: 7F
keyword: GEOM=CHECK
keyword: GUESS=READ
keyword: NOSYMM
keyword: GFINPUT
keyword: #INT=ULTRAFINE
keyword: EMPIRICALDISPERSION=GD3BJ
keyword: IOP(3/174=1000000,3/175=358940,3/177=12092,3/178=5938951)
keyword: SCRF=(SMD,SOLVENT=WATER)
keyword: SCF=(VSHIFT=300,NOSYM,NOVARACC,MAXCYCLE=200,CONVER=5)
keyword: SP
title: #P # PBEPBE/GENECP 5D 7F # GEOM=CHECK # GUESS=READ # NOSYMM # GFINPUT
basis: NPDir=0 NMtPBC= 1 NCelOv= 1 NCel= 1 NClECP= 1 NCelD= 1
basis: NCelK= 1 NCelE2= 1 NClLst= 1 CellRange= 0.0.
basis: One-electron integrals computed using PRISM.
title: Mulliken charges:
elementType: Zr N C H H C H H N C H H C H H C H H C O O C H H C O O N C H H C H H N C C H H C O O C C C H H H H O O H H
charge: 1.707920 0.241440 0.025514 0.055950 0.057305 0.008324 0.051961 0.041216 0.252621 0.026538 0.055078 0.051124 -0.001676 0.054436 0.042198 0.009136 0.062263 0.048902 0.343952 -0.680248 -0.691653 0.023838 0.061556 0.050136 0.359619 -0.679046 -0.692279 0.208125 0.013957 0.056403 0.057555 -0.010804 0.056286 0.042313 0.235665 0.016753 -0.004317 0.060462 0.054358 0.394192 -0.730938 -0.655591 0.379801 0.005881 0.002661 0.056315 0.040578 0.061767 0.051881 -0.691210 -0.700736 0.054255 0.058262
chargesum: -0.00000
dipole: -0.5665 -9.7091 -33.3126
dipole: 34.7032
quadrupole: -216.6770 -199.0391 -532.7722
quadrupole: 0.7282 15.8589 -16.2943
quadrupole: 99.4858 117.1237 -216.6094 0.7282 15.8589 -16.2943
hfenergy: -1491.4198029 hartree
pointgroup: C01 [X(C16H24N4O8Zr1)]
dipole: -0.2228665 -3.8198635 -13.1061661 debye
InChI: InChI=1S/C16H24N4O8.Zr/c21-13(22)9-17-1-2-18(10-14(23)24)5-6-20(12-16(27)28)8-7-19(4-3-17)11-15(25)26;/h1-12H2;/q-4;+4
charge 0 multiplicity 1
53 atoms
Zr -0.55848653 -0.73238911 5.24693572
N  -2.59677882 -0.81511276 3.78752052
C  -3.08102616 -2.20579834 3.5714992
H  -3.77514158 -2.22878661 2.71526364
H  -3.65619255 -2.5102856 4.45510467
C  -1.93611305 -3.15659855 3.34365046
H  -2.31689284 -4.18524636 3.22659319
H  -1.4021471 -2.89855177 2.42033761
N  -0.96588316 -3.09081777 4.46149059
C  0.3132273 -3.7295291 4.04396228
H  0.09971453 -4.64941568 3.47491039
H  0.85835295 -4.03171701 4.94711951
C  -2.34279045 -0.14833562 2.48886796
H  -3.29595383 0.12952747 2.0076168
H  -1.8482622 -0.87330961 1.82958351
C  -3.61668132 -0.09919001 4.58174614
H  -4.6200818 -0.21569489 4.14206526
H  -3.38161134 0.97386779 4.61828288
C  -3.59064176 -0.61705099 6.01482789
O  -2.45443778 -1.1338639 6.39011735
O  -4.58592846 -0.51364999 6.75027208
C  -1.44418632 -3.79855852 5.66415988
H  -1.39100562 -4.89144763 5.53394747
H  -2.48731679 -3.53159813 5.87690378
C  -0.60923664 -3.36437834 6.85820492
O  0.05885588 -2.25450083 6.69347375
O  -0.59201375 -4.03062001 7.90378156
N  1.42128104 -1.53813724 3.97737089
C  1.90144567 -0.48774963 3.03381109
H  2.58753566 -0.93903577 2.2986168
H  2.48339038 0.2453689 3.60619065
C  0.74844302 0.18161361 2.33452794
H  1.11941879 0.96157758 1.6489773
H  0.19038921 -0.54506839 1.73153264
N  -0.18496478 0.77026253 3.32534148
C  -1.48965066 1.0833221 2.67173985
C  0.35415888 2.02568157 3.89092203
H  0.27110124 2.84975478 3.1643923
H  1.41807527 1.90202954 4.13401761
C  -0.36207575 2.3822394 5.18466319
O  -1.00304895 1.41011396 5.76194183
O  1.32135152 0.06506773 6.03262973
C  2.44344206 -0.59812518 5.99009103
C  2.47497688 -1.74274691 4.9929205
C  1.1490183 -2.78604015 3.22239744
H  2.09727313 -3.27026352 2.9353504
H  0.62887434 -2.51262725 2.29591561
H  3.46786236 -1.82585292 4.52369128
H  2.28599026 -2.66887173 5.55293376
O  3.42198354 -0.35008798 6.71081864
O  -0.29519355 3.53892261 5.63634437
H  -1.30425252 1.56314154 1.69646586
H  -2.01126615 1.81826272 3.29805674
