program: Gaussian 16
title: SINGLE POINT - PBEPBE-GD3MBJ-SMDwater_def2-QZVP-QZVPD-SDD
version: ES64L-G16RevC.01
method: RPBEPBE
basis: GenECP
operation: SP
keyword: #P
keyword: #
keyword: PBEPBE/GENECP
keyword: 5D
keyword: 7F
keyword: GEOM=CHECK
keyword: GUESS=READ
keyword: NOSYMM
keyword: GFINPUT
keyword: #INT=ULTRAFINE
keyword: EMPIRICALDISPERSION=GD3BJ
keyword: IOP(3/174=1000000,3/175=358940,3/177=12092,3/178=5938951)
keyword: SCRF=(SMD,SOLVENT=WATER)
keyword: SCF=(VSHIFT=300,NOSYM,NOVARACC,MAXCYCLE=200,CONVER=5)
keyword: SP
title: #P # PBEPBE/GENECP 5D 7F # GEOM=CHECK # GUESS=READ # NOSYMM # GFINPUT
basis: NPDir=0 NMtPBC= 1 NCelOv= 1 NCel= 1 NClECP= 1 NCelD= 1
basis: NCelK= 1 NCelE2= 1 NClLst= 1 CellRange= 0.0.
basis: One-electron integrals computed using PRISM.
title: Mulliken charges:
elementType: Hf O O O O O O H H H H H H H H H H H H O O O O O O H H H H H H H H H H H H O O O O O O H H H H H H H H H H H H O H H
charge: 3.191525 -0.468801 -0.536636 -0.615417 -0.686935 -0.553307 -0.568075 0.202284 0.248742 0.235573 0.290735 0.243997 0.232976 0.218867 0.218505 0.241122 0.274147 0.261434 0.258362 -0.470485 -0.442345 -0.475956 -0.450016 -0.447278 -0.454526 0.260330 0.257400 0.271338 0.258782 0.249997 0.260218 0.297816 0.290543 0.283714 0.286400 0.292861 0.294981 -0.431720 -0.453379 -0.427284 -0.446024 -0.429804 -0.435903 0.295878 0.254590 0.251592 0.254036 0.242225 0.251457 0.291295 0.293340 0.287197 0.292427 0.285540 0.284641 -0.497237 0.288102 0.296162
chargesum: 4.00000
dipole: 2.1447 -0.1805 8.2041
dipole: 8.4817
quadrupole: -2.6630 -20.7451 -60.4309
quadrupole: 11.9168 4.1321 26.0938
quadrupole: 25.2833 7.2012 -32.4845 11.9168 4.1321 26.0938
hfenergy: -1500.1183936 hartree
pointgroup: C01[X(H38Hf1O19)]
dipole: 1.0005364 -0.4318678 2.2817054 debye
InChI: InChI=1S/Hf.19H2O/h;19*1H2
charge 4 multiplicity 1
58 atoms
Hf -0.12999896 0.2255166 0.39632332
O  -1.46248635 2.00703188 0.6949569
O  -0.46852347 -1.68187319 1.54067503
O  0.58597482 1.78409715 -0.97925762
O  -1.72591994 -0.28291243 -0.95688686
O  0.87825717 -0.9958699 -1.26699373
O  1.98855776 0.2169369 1.2933579
H  -0.98779202 2.65752365 1.28682451
H  -1.44820474 -1.89298898 1.53919513
H  1.54399046 1.87761581 -1.24461276
H  -2.43762793 0.38134272 -1.22709738
H  0.61674848 -1.96032762 -1.34802617
H  2.61855726 -0.55222158 1.21763847
H  -2.3333603 1.72170231 1.09616522
H  0.07015182 -2.50299269 1.33574921
H  -0.05467576 2.23402464 -1.62687859
H  -2.06568876 -1.2306072 -1.0942681
H  1.87744747 -0.9441656 -1.30681523
H  2.46337884 1.09054361 1.3878746
O  -3.87052665 0.91989726 1.15953596
O  1.22528225 -3.69229426 0.99614622
O  -1.22098632 2.92636532 -2.49252923
O  -2.52345466 -2.7650689 -1.16430657
O  3.58070321 -0.71472398 -1.39311724
O  2.8443836 2.74881354 1.46359863
H  -3.71703364 -0.05658126 1.26201211
H  2.09201125 -3.19462905 0.99922294
H  -2.052961 2.48902218 -2.1886596
H  -1.62616312 -3.1946879 -1.28185853
H  3.61065234 0.27851096 -1.31192473
H  1.96706481 3.15539627 1.69545691
H  -4.53932508 1.15846766 1.82554727
H  1.31576058 -4.41784267 1.63909014
H  -1.11973479 2.64588766 -3.4207331
H  -3.01713881 -2.93931305 -1.98608889
H  3.97331102 -0.92723577 -2.25852464
H  3.46075311 3.01008107 2.17080197
O  0.24524317 3.67987201 1.97875433
O  -3.16963484 -1.80638008 1.36296091
O  3.2604609 2.00232673 -1.14891111
O  -3.55231031 1.54802146 -1.50923445
O  0.04047226 -3.55635016 -1.38275627
O  3.39742438 -2.04877307 0.94275534
H  0.14479654 4.55907571 1.56599058
H  -3.18337037 -2.25458719 0.480762
H  3.27784166 2.40124421 -0.23922104
H  -3.91590609 1.4521322 -0.58959192
H  0.50869647 -3.83044901 -0.54332801
H  3.68090408 -1.71959375 0.04753495
H  0.09415959 3.84053544 2.93013012
H  -3.68348203 -2.38426276 1.95625396
H  3.7074451 2.64037898 -1.73352698
H  -4.24660781 1.21933581 -2.1090632
H  0.38211836 -4.12668328 -2.09439184
H  4.21511675 -2.2280447 1.441074
O  -0.52316549 0.60527542 2.84938627
H  0.01435572 -0.10675784 3.24567649
H  -0.072542 1.43354272 3.10175239
