program: Gaussian 16
title: SINGLE POINT - PBEPBE-GD3MBJ-SMDwater_def2-QZVP-QZVPD-SDD
version: ES64L-G16RevC.01
method: RPBEPBE
basis: Gen
operation: SP
keyword: #P#
keyword: PBEPBE/GEN
keyword: 5D
keyword: 7F
keyword: #
keyword: GEOM=CHECK
keyword: GUESS=READ
keyword: NOSYMM
keyword: GFINPUT
keyword: INT=ULTRAFINE
keyword: EMPIRICALDISPERSION=GD3BJ
keyword: IOP(3/174=1000000,3/175=358940,3/177=12092,3/178=5938951)
keyword: SCRF=(SMD,SOLVENT=WATER)
keyword: SCF=(VSHIFT=300,NOSYM,NOVARACC,MAXCYCLE=200,CONVER=5)
keyword: SP
title: #P # PBEPBE/GEN 5D 7F # GEOM=CHECK # GUESS=READ # NOSYMM # GFINPUT # I
basis: NPDir=0 NMtPBC= 1 NCelOv= 1 NCel= 1 NClECP= 1 NCelD= 1
basis: NCelK= 1 NCelE2= 1 NClLst= 1 CellRange= 0.0.
basis: One-electron integrals computed using PRISM.
basis: NBasis= 1584 RedAO= T EigKep= 8.87D-06 NBF= 1584
basis: NBsUse= 1584 1.00D-06 EigRej= -1.00D+00 NBFU= 1584
title: Mulliken charges:
elementType: C N C C H H H H H H C N H H C C H H H H C O O C O O C O O C O O
charge: 0.278579 -0.510364 0.140170 0.090298 0.045094 0.053543 0.001592 0.027871 0.068145 0.019634 0.237535 -0.495720 0.050342 0.040408 0.112982 0.058432 0.068488 0.016778 0.048914 0.057576 0.487386 -0.789671 -0.798793 0.475568 -0.785296 -0.781965 0.482817 -0.817004 -0.786903 0.477622 -0.786689 -0.787366
chargesum: -4.00000
dipole: -1.1541 -1.2391 -2.1697
dipole: 2.7522
quadrupole: -424.7858 -186.7417 -227.7002
quadrupole: 6.6508 -12.8438 -4.5402
quadrupole: -145.0432 93.0009 52.0424 6.6508 -12.8438 -4.5402
hfenergy: -1099.5775586 hartree
pointgroup: C01 [X(C10H12N2O8)]
dipole: -0.3339385 -0.3412845 -0.63313 debye
InChI: InChI=1S/C10H12N2O8/c13-7(14)3-11(4-8(15)16)1-2-12(5-9(17)18)6-10(19)20/h1-6H2
charge -4 multiplicity 1
32 atoms
C  -0.58322057 -0.40978739 -0.46624331
N  -1.83823037 0.35145383 -0.44482765
C  -2.81674242 -0.20687249 -1.37217789
C  -2.38081005 0.56842467 0.89653597
H  -1.70584817 1.23299645 1.45590254
H  -3.32267366 1.12929454 0.79105434
H  -0.72196987 -1.46059038 -0.14384154
H  -0.24924502 -0.44153337 -1.51545634
H  -2.29270472 -0.44108187 -2.31439789
H  -3.24941082 -1.16200003 -1.01923451
C  0.51138424 0.22434351 0.39171154
N  1.81147725 -0.41968215 0.16911031
H  0.26558749 0.10073355 1.45685156
H  0.54383221 1.31411446 0.19691683
C  2.46814371 0.03567868 -1.05123243
C  2.70147179 -0.37334073 1.3249661
H  1.71088569 0.12552185 -1.84645958
H  2.91201189 1.04336314 -0.93765298
H  2.18899307 -0.84334181 2.180436
H  3.57696259 -1.0057919 1.11236826
C  3.24744054 0.98026637 1.84642875
O  2.80387964 2.07496668 1.3835725
O  4.13251748 0.87996321 2.76111173
C  3.55736697 -0.88625853 -1.63331484
O  4.32838024 -0.33250357 -2.48632298
O  3.61402386 -2.10619352 -1.28920992
C  -2.6914935 -0.62970948 1.82738342
O  -2.95226518 -0.31274539 3.03636467
O  -2.69343156 -1.81381686 1.37148559
C  -3.98962537 0.70981377 -1.7723655
O  -3.92017983 1.96063876 -1.57262777
O  -4.96650757 0.113676 -2.33703494
