program: Gaussian 16
title: Step 5 - PBEPBE-GD3MBJ-SMD(water)_def2-TZVP-TZVPD-SDD
version: ES64L-G16RevC.01
method: RPBEPBE
basis: Gen
operation: Freq
keyword: #P#
keyword: PBEPBE/CHKBASIS
keyword: #
keyword: GEOM=CHECK
keyword: GUESS=READ
keyword: NOSYMM
keyword: INT=ULTRAFINE#
keyword: EMPIRICALDISPERSION=GD3BJ
keyword: IOP(3/174=1000000,3/175=358940,3/177=12092,3/178=5938951)
keyword: SCRF=(SMD,SOLVENT=WATER)
keyword: CPHF=(GRID=FINEGRID)
keyword: #SCF=(VSHIFT=300,NOSYM,MAXCYCLE=250)
keyword: FREQ
title: #P # PBEPBE/CHKBASIS # GEOM=CHECK # GUESS=READ # NOSYMM # INT=ULTRAFIN
converged: YES YES YES YES
title: Mulliken charges:
elementType: Zr O O O O O O O O N N C C C C C C C C C C H H H H H H H H H H H H
charge: 2.250771 -0.664574 -0.653456 -0.617760 -0.648327 -0.612132 -0.621918 -0.609102 -0.612916 0.088716 0.112138 -0.205576 -0.193394 -0.192361 0.458125 -0.159062 0.452642 -0.166505 0.415094 -0.180846 0.423561 0.166638 0.147161 0.161118 0.143177 0.161502 0.168232 0.157610 0.165924 0.160638 0.173931 0.157645 0.173304
chargesum: -0.00000
title: Mulliken charges with hydrogens summed into heavy atoms:
elementType: Zr O O O O O O O O N N C C C C C C C C C C
charge: 2.250771 -0.664574 -0.653456 -0.617760 -0.648327 -0.612132 -0.621918 -0.609102 -0.612916 0.088716 0.112138 0.108223 0.110902 0.137374 0.458125 0.164472 0.452642 0.168064 0.415094 0.150103 0.423561
polarizability: 3.28998459e+02 1.39767315e+01 2.70900419e+02 9.48153755e+00 -4.63693623e+00 3.19107199e+02
1716.lowfreq: -0.0007 -0.0006 -0.0003 28.9164 39.9673 45.9372 61.0390 69.0106 73.2164
frequency: 59.7975 60.5119 71.7838 78.7724 120.5247 130.4306 176.9165 180.0596 196.1786 225.1208 234.1278 237.9308 262.1812 281.0176 285.7593 299.1416 310.9439 316.3947 344.7739 353.0803 362.5968 401.8733 412.2985 445.4107 452.2110 461.4858 488.2233 526.5219 539.2903 571.2530 577.0985 579.4749 615.6190 645.4867 697.6227 702.4655 728.9145 737.4534 817.2117 854.8253 902.3747 918.1810 919.0989 930.4135 944.9248 950.2670 959.4207 981.6272 984.6289 1022.3838 1042.2696 1074.8323 1080.6559 1100.5712 1159.2497 1225.7927 1229.0250 1234.9591 1239.6970 1256.1452 1260.8401 1263.3985 1270.4177 1275.7755 1288.7199 1312.8131 1321.4758 1330.0696 1330.8265 1352.4256 1392.7804 1400.4456 1404.0243 1406.1700 1409.8432 1430.8154 1437.0981 1563.0165 1564.4254 1569.2630 1579.6619 2980.9298 2987.5837 2989.8286 2990.4904 2994.3637 2996.3226 3029.8515 3040.9966 3042.7501 3044.6930 3047.0694 3049.4429
redmass: 11.3454 13.0386 9.4786 8.2161 4.3547 8.5894 7.0073 5.6527 5.5940 8.9695 7.6342 6.2512 6.0099 5.5545 4.4628 5.1951 3.2742 4.3598 5.8219 6.4135 3.3672 7.2882 5.0367 3.5463 5.0969 3.5413 4.6490 3.8439 4.2844 3.4997 2.5871 2.7053 3.6166 3.3768 6.8070 6.3064 6.6779 6.7538 2.4939 3.3563 5.5792 5.0229 5.0148 3.5330 2.4559 2.8522 2.9700 2.6217 2.0245 2.8736 2.9027 2.6329 2.8126 2.5488 2.7443 1.3360 1.3559 1.3241 1.1762 4.0215 3.1933 1.5412 2.4983 1.9500 3.5271 1.6630 1.6447 1.7367 1.6056 1.3176 1.2411 1.1121 1.1528 1.1315 1.1472 1.0756 1.0969 11.4960 11.4625 11.4566 11.6335 1.0635 1.0621 1.0607 1.0618 1.0598 1.0594 1.1017 1.1023 1.1033 1.1040 1.1030 1.1007
irintensity: 18.3516 11.6009 21.6312 8.6950 18.1122 36.5684 7.8108 6.1940 20.9317 53.8632 25.8264 29.7122 26.1126 0.2399 26.7559 46.6722 1.7262 34.2974 58.8461 273.0545 52.9034 42.1482 217.1843 26.3824 34.5579 175.9254 30.7666 75.9758 20.4708 6.0647 17.9107 5.0941 6.9846 87.1475 86.6757 105.1190 12.7177 168.1083 15.8922 66.7446 92.4948 187.5116 151.5151 108.4427 4.1691 21.7186 48.7249 32.1497 7.2692 70.2554 12.0816 21.6416 6.0680 34.3380 13.3597 39.1162 108.0738 9.0583 3.3859 282.6348 261.3101 43.8549 750.9987 476.5972 539.0917 79.6663 104.2772 151.6087 213.1927 9.8663 1.3416 29.1609 16.1158 7.9509 7.9817 23.5529 11.0105 805.6950 2072.7839 1474.9348 364.6301 16.0118 19.7916 45.6463 26.8337 36.8670 25.6839 9.5818 11.5632 12.4778 3.3848 5.4690 14.1495
temp: 298.150 k
press: 1.00000 atm
elementType: 40 8 8 8 8 8 8 8 8 7 7 6 6 6 6 6 6 6 6 6 6 1 1 1 1 1 1 1 1 1 1 1 1
symmnumber: 1
zpe: 612236.4 jmol-1
zpe.correction: 0.233189 hartree
zpe.thermalcorrener: 0.251757 hartree
zpe.thermalcorrenthalpy: 0.252702 hartree
zpe.thermalcorrgfe: 0.187511 hartree
zpe.sumelectzpe: -1146.028983 hartree
zpe.sumelectthermal: -1146.010414 hartree
zpe.sumelectthermalent: -1146.009470 hartree
zpe.sumelectthermalfe: -1146.074661 hartree
dipole: 0.3321 -6.7279 -0.7112
dipole: 6.7735
quadrupole: -191.0301 -120.3038 -218.8218
quadrupole: -18.4129 -17.3196 7.8255
quadrupole: -14.3115 56.4148 -42.1032 -18.4129 -17.3196 7.8255
hfenergy: -1146.2621716 hartree
pointgroup: C01 [X(C10H12N2O8Zr1)]
dipole: 0.1306742 -2.6469602 -0.2797954 debye
polarizability: 328.9984587|13.9767315|270.9004193|9.4815375|-4.6369362|319.1071988 unknown
InChI: InChI=1S/C10H12N2O8.Zr/c13-7(14)3-11(4-8(15)16)1-2-12(5-9(17)18)6-10(19)20;/h1-6H2;/q-4;+4
charge 0 multiplicity 1
33 atoms
Zr -0.24115805 1.13088493 0.10785678
O  -2.34970955 0.98831871 -0.5356128
O  1.75654722 1.85974072 0.77734713
O  -0.3252156 0.45439686 2.20219051
O  0.24056527 1.11888768 -2.03453579
O  -3.91941491 -0.12040773 -1.70688747
O  3.66287661 1.38179365 1.87324563
O  -1.30420214 -0.74478144 3.8322122
O  1.62694999 0.8409461 -3.77907178
N  -1.1139189 -1.16737834 0.26642642
N  1.61293337 -0.46169249 -0.42024341
C  -0.01462856 -2.17161674 0.28117837
C  1.07162358 -1.81251908 -0.69918008
C  -2.03153766 -1.3512758 -0.87201601
C  -2.85664686 -0.08808076 -1.06753687
C  2.51311847 -0.40608236 0.74680567
C  2.69123723 1.04609234 1.17692392
C  -1.84968602 -1.25306615 1.54507471
C  -1.1115168 -0.49207357 2.63376229
C  2.31377677 0.04657441 -1.61595262
C  1.34148646 0.69401798 -2.58060176
H  0.38808624 -2.20391792 1.30239212
H  -0.41526079 -3.17332542 0.057557
H  0.6805122 -1.80116281 -1.72594387
H  1.87867754 -2.5629042 -0.66377356
H  -1.44762825 -1.51059427 -1.79074971
H  -2.68279751 -2.22721094 -0.72747201
H  2.06428308 -0.94719918 1.59198636
H  3.48952011 -0.86508862 0.5262601
H  -2.83449076 -0.7749748 1.43593911
H  -2.01453863 -2.30156334 1.83556805
H  3.02178037 0.8350661 -1.31985439
H  2.8907765 -0.75110353 -2.10689425
