program: Gaussian 16
title: Step 5 - PBEPBE-GD3MBJ-SMD(water)_def2-TZVP-TZVPD-SDD
version: ES64L-G16RevC.01
method: RPBEPBE
basis: Gen
operation: Freq
keyword: #P#
keyword: PBEPBE/CHKBASIS
keyword: #
keyword: GEOM=CHECK
keyword: GUESS=READ
keyword: NOSYMM
keyword: INT=ULTRAFINE#
keyword: EMPIRICALDISPERSION=GD3BJ
keyword: IOP(3/174=1000000,3/175=358940,3/177=12092,3/178=5938951)
keyword: SCRF=(SMD,SOLVENT=WATER)
keyword: CPHF=(GRID=FINEGRID)
keyword: #SCF=(VSHIFT=300,NOSYM,MAXCYCLE=250)
keyword: FREQ
title: #P # PBEPBE/CHKBASIS # GEOM=CHECK # GUESS=READ # NOSYMM # INT=ULTRAFIN
converged: YES YES YES YES
title: Mulliken charges:
elementType: Ti O O O O O O O O N N C C C C C C C C C C H H H H H H H H H H H H
charge: 0.882830 -0.549616 -0.555502 -0.445346 -0.447483 -0.546296 -0.545609 -0.558545 -0.558602 0.112095 0.107582 -0.122756 -0.118679 -0.108493 0.445164 -0.107700 0.448427 -0.107955 0.404768 -0.107522 0.408038 0.160017 0.160225 0.160203 0.160373 0.179520 0.179241 0.179608 0.179468 0.168545 0.187518 0.169175 0.187309
chargesum: -0.00000
title: Mulliken charges with hydrogens summed into heavy atoms:
elementType: Ti O O O O O O O O N N C C C C C C C C C C
charge: 0.882830 -0.549616 -0.555502 -0.445346 -0.447483 -0.546296 -0.545609 -0.558545 -0.558602 0.112095 0.107582 0.197486 0.201896 0.250267 0.445164 0.251376 0.448427 0.248109 0.404768 0.248963 0.408038
chargesum: 0.00000
polarizability: 2.99327500e+02 5.92478257e+00 3.45211918e+02 4.77389726e+01 1.00268581e+01 2.99921743e+02
1716.lowfreq: -18.5907 -0.0029 -0.0028 -0.0010 24.2351 30.5562 60.3353 61.0058 73.7382
frequency: 60.0713 60.6350 73.6107 75.4641 139.0257 139.4437 189.1598 198.0954 215.5570 238.1124 251.4620 255.9689 267.5296 297.5672 304.7799 316.1274 318.9233 350.7281 364.5475 376.9584 404.6187 415.1053 432.6885 452.0411 469.6110 485.1576 506.1747 540.6722 547.4646 561.1370 571.7375 577.5447 596.1438 638.7781 688.7745 703.4619 709.5137 715.5841 810.0791 855.4082 870.8843 878.7359 909.7041 916.5442 942.6476 944.9161 954.5365 971.0520 985.8512 1010.0906 1033.2209 1060.7162 1067.4075 1092.4119 1155.7841 1165.6415 1171.3812 1211.8321 1227.7005 1229.5922 1231.0836 1234.0770 1237.7348 1261.5550 1272.3291 1309.0845 1313.1698 1315.0589 1316.6546 1355.4016 1396.7901 1406.0785 1409.5982 1414.0809 1418.6444 1435.1543 1440.6780 1618.0399 1619.9915 1625.2195 1639.0255 3002.2454 3003.9797 3006.9441 3007.1142 3009.1534 3010.2837 3046.9153 3055.7734 3058.6391 3063.1316 3064.0416 3065.1679
redmass: 12.7325 13.2204 8.7309 9.4245 5.2701 5.6403 8.7697 11.2383 5.5916 7.5612 5.9243 6.7840 4.8448 4.8429 4.4727 4.2833 3.6132 3.7365 8.7692 3.9032 4.8962 11.2940 5.2780 7.3974 3.5182 3.9368 4.1223 3.7504 4.1150 3.4119 2.7302 2.5075 3.8354 3.3405 5.9163 6.9493 7.1897 7.0696 2.4144 3.9660 6.1217 5.3198 5.1237 5.2937 2.4242 2.5305 2.5498 2.5031 1.9958 2.8691 2.7775 3.0417 2.6960 2.4346 2.9455 7.1547 5.7089 5.4936 1.3291 1.3708 1.5667 1.2289 2.5912 1.3650 1.3539 1.4533 1.4594 1.5579 1.4942 1.2887 1.2024 1.0946 1.1172 1.1486 1.1145 1.0746 1.0906 12.1725 12.1003 12.2007 12.3676 1.0606 1.0606 1.0603 1.0606 1.0597 1.0598 1.1058 1.1047 1.1048 1.1043 1.1041 1.1048
irintensity: 15.0002 11.9036 21.4202 3.1377 14.2908 11.2402 6.0899 7.4142 3.5542 37.4308 1.4549 8.2352 23.7698 114.2675 8.2016 12.7359 9.2168 1.8649 91.4067 21.9667 487.6980 35.6019 367.4500 19.8564 2.9596 413.0586 25.2471 156.4619 6.7249 12.2893 6.7839 39.6824 6.8391 109.7319 209.9194 114.1329 11.4242 222.3034 9.6556 57.7396 439.1383 11.9369 423.2935 4.6896 7.4454 3.8032 40.3619 13.9039 5.8333 75.3414 8.0457 5.3615 1.8021 34.8501 60.9919 945.2559 117.6903 1362.5997 14.0242 32.6531 14.7396 13.6769 209.9312 48.0291 10.5426 28.3267 14.8047 72.0511 85.3196 1.6199 1.1930 36.7475 3.4317 4.4509 21.6158 26.8529 21.8396 306.7313 1945.5696 2212.5128 82.1115 5.4523 12.2759 26.7917 5.9773 16.7204 6.9300 5.0633 6.1294 2.2575 2.0152 2.5926 4.3869
temp: 298.150 k
press: 1.00000 atm
elementType: 22 8 8 8 8 8 8 8 8 7 7 6 6 6 6 6 6 6 6 6 6 1 1 1 1 1 1 1 1 1 1 1 1
symmnumber: 1
zpe: 613917.3 jmol-1
zpe.correction: 0.233829 hartree
zpe.thermalcorrener: 0.251981 hartree
zpe.thermalcorrenthalpy: 0.252926 hartree
zpe.thermalcorrgfe: 0.189104 hartree
zpe.sumelectzpe: -1948.257588 hartree
zpe.sumelectthermal: -1948.239435 hartree
zpe.sumelectthermalent: -1948.238491 hartree
zpe.sumelectthermalfe: -1948.302313 hartree
dipole: 9.9352 0.4244 -9.9460
dipole: 14.0645
quadrupole: -141.3460 -147.2815 -236.7196
quadrupole: 52.7426 -9.4168 -56.1785
quadrupole: 33.7697 27.8342 -61.6039 52.7426 -9.4168 -56.1785
hfenergy: -1948.4914165 hartree
pointgroup: C01[X(C10H12N2O8Ti1)]
dipole: 3.9087928 0.1669698 -3.9130482 debye
polarizability: 299.3274997|5.9247826|345.2119178|47.7389726|10.0268581|299.9217428 unknown
InChI: InChI=1S/C10H12N2O8.Ti/c13-7(14)3-11(4-8(15)16)1-2-12(5-9(17)18)6-10(19)20;/h1-6H2;/q-4;+4
charge 0 multiplicity 1
33 atoms
Ti 0.25323618 5.45270184 4.52063595
O  -0.76516238 3.77715452 4.38243129
O  0.32836149 7.08116471 5.61610714
O  1.77742355 4.91296669 5.67686238
O  -0.91464651 6.00136221 3.00556654
O  -1.58459319 2.34393287 2.85013471
O  1.8043955 8.53519725 6.5004209
O  3.22740825 3.31752726 6.31560257
O  -1.62498893 7.65143266 1.6523704
N  1.50107135 4.10175534 3.27382264
N  1.44825068 6.89920192 3.34080869
C  2.60247051 4.85004353 2.60328399
C  2.14367098 6.22620732 2.20598511
C  0.51695745 3.44804134 2.38429301
C  -0.71686447 3.12731725 3.22268167
C  2.31318849 7.54273527 4.35359113
C  1.46251032 7.77703038 5.5985703
C  2.10291292 3.10447329 4.18942261
C  2.44455267 3.79032589 5.49353338
C  0.49523979 7.88722652 2.78332169
C  -0.78137835 7.16858476 2.40544778
H  3.42939333 4.9163833 3.32281482
H  2.96322744 4.28901241 1.72809114
H  1.42264634 6.16337176 1.38015316
H  2.99139381 6.83932028 1.86503383
H  0.21949569 4.1359377 1.58107686
H  0.92669553 2.53546141 1.92714221
H  3.14190171 6.87375648 4.622787
H  2.7354002 8.48874339 3.98427295
H  1.37548123 2.31266253 4.41938193
H  2.9833227 2.63209314 3.73217576
H  0.23554149 8.63652558 3.54486911
H  0.93528423 8.4158492 1.92610734
