program: Gaussian 16
title: Step 5 - PBEPBE-GD3MBJ-SMD(water)_def2-TZVP-TZVPD-SDD
version: ES64L-G16RevC.01
method: RPBEPBE
basis: Gen
operation: Freq
keyword: #P#
keyword: PBEPBE/CHKBASIS
keyword: #
keyword: GEOM=CHECK
keyword: GUESS=READ
keyword: NOSYMM
keyword: INT=ULTRAFINE#
keyword: EMPIRICALDISPERSION=GD3BJ
keyword: IOP(3/174=1000000,3/175=358940,3/177=12092,3/178=5938951)
keyword: SCRF=(SMD,SOLVENT=WATER)
keyword: CPHF=(GRID=FINEGRID)
keyword: #SCF=(VSHIFT=300,NOSYM,MAXCYCLE=250)
keyword: FREQ
title: #P # PBEPBE/CHKBASIS # GEOM=CHECK # GUESS=READ # NOSYMM # INT=ULTRAFIN
converged: YES YES YES YES
title: Mulliken charges:
elementType: Ti O O O O O O O O N N C C C C C C C C C C H H H H H H H H H H H H
charge: 1.027360 -0.558250 -0.436278 -0.560620 -0.432070 -0.544345 -0.568496 -0.543866 -0.575097 0.072897 0.062771 -0.098818 -0.099694 -0.096253 0.409197 -0.104085 0.408460 -0.097229 0.377457 -0.097409 0.381755 0.167987 0.151299 0.166852 0.152106 0.183805 0.176270 0.183506 0.176150 0.171651 0.185643 0.172487 0.184857
chargesum: -0.00000
title: Mulliken charges with hydrogens summed into heavy atoms:
elementType: Ti O O O O O O O O N N C C C C C C C C C C
charge: 1.027360 -0.558250 -0.436278 -0.560620 -0.432070 -0.544345 -0.568496 -0.543866 -0.575097 0.072897 0.062771 0.220468 0.219263 0.263823 0.409197 0.255571 0.408460 0.260064 0.377457 0.259935 0.381755
chargesum: 0.00000
polarizability: 2.86597782e+02 -1.15587787e+01 3.52249039e+02 3.20479509e+01 -1.13708827e+01 3.01868590e+02
1716.lowfreq: -36.4065 -22.4645 -13.2785 -0.0037 -0.0030 0.0033 49.3340 51.2160 62.4294
frequency: 48.9430 50.2979 62.1524 75.9542 113.4365 120.8337 137.1255 161.4845 165.4281 178.9211 218.0981 226.5764 234.9118 285.4447 296.0166 302.3676 333.3904 340.2428 359.5532 389.8998 395.8511 403.9046 411.3931 455.9329 463.2605 464.7641 501.7912 515.5949 541.2091 543.2379 564.2374 574.2838 611.5557 650.2383 691.9523 703.2292 705.6468 716.0226 829.9630 860.9965 891.1256 896.6849 908.7142 915.7195 939.5187 945.7314 949.8851 961.8523 982.7741 1003.2925 1041.8757 1071.0609 1080.4333 1084.7412 1144.9418 1181.2260 1184.8845 1197.2380 1222.1930 1224.3171 1240.8497 1242.8010 1247.5724 1275.6024 1285.9011 1298.6204 1310.5013 1314.1631 1317.2141 1348.3198 1379.4206 1395.2134 1401.5021 1404.9841 1411.6387 1452.1181 1461.4725 1614.7116 1619.0000 1620.7716 1636.1676 2999.6822 3003.3983 3004.5079 3005.5403 3007.1502 3007.4307 3053.5423 3054.3823 3055.2564 3058.5182 3058.9931 3072.3426
redmass: 12.7572 11.3771 8.4680 9.0730 5.1149 5.8209 11.6226 8.6733 10.1222 3.8405 4.3372 7.3861 5.8724 5.8289 7.8043 7.2192 5.3852 4.6531 6.2958 3.1925 5.6803 3.8283 5.6657 5.1874 4.1946 3.8755 4.1211 3.1151 2.6364 2.5116 3.8670 3.2485 4.0314 4.3453 6.3223 6.8647 6.5294 6.5356 2.3870 3.6676 6.1438 5.4030 4.6090 4.6593 2.4311 3.1400 2.9942 2.4793 2.1178 2.6472 3.2932 3.4402 3.2356 2.9092 2.1355 4.8304 5.8162 1.1893 6.6376 1.3141 1.2971 1.7608 2.6146 1.2880 1.2966 1.3993 1.4384 1.4662 1.4356 1.3029 1.2688 1.0853 1.0924 1.1404 1.1410 1.0894 1.0932 12.1029 12.0563 12.1875 12.2390 1.0652 1.0596 1.0607 1.0633 1.0597 1.0596 1.1045 1.1041 1.1011 1.1047 1.1047 1.0991
irintensity: 18.5409 10.1118 26.3179 8.9525 4.7028 26.0327 5.5825 23.4703 30.1006 21.6171 8.9843 17.0003 1.2599 33.1347 19.4391 7.6965 139.3106 52.6506 119.7488 233.0062 98.1013 19.8479 300.7355 141.9200 197.6839 193.9345 23.4537 55.8620 24.3068 31.1829 0.3023 37.7307 24.6318 145.1246 133.2399 130.3740 54.3048 173.8642 33.3026 85.6013 620.1218 5.8270 424.5671 3.4106 12.5163 15.0732 14.4910 0.2040 35.7322 40.7777 8.6955 46.9573 11.7569 25.1344 0.4280 919.9271 177.0865 119.3736 1271.2650 3.8892 10.9836 124.3444 350.8493 0.3782 17.9103 133.0691 53.6937 6.4566 13.7008 21.4025 34.5241 20.8725 12.4025 11.6707 9.4965 29.8090 21.2441 795.0861 1562.5893 2136.4472 54.9362 5.1176 12.3255 20.0753 27.2067 25.1010 1.6309 5.0771 5.9302 3.1836 0.9654 1.2273 20.8779
temp: 298.150 k
press: 1.00000 atm
elementType: 22 8 8 8 8 8 8 8 8 7 7 6 6 6 6 6 6 6 6 6 6 1 1 1 1 1 1 1 1 1 1 1 1
symmnumber: 1
zpe: 611253.7 jmol-1
zpe.correction: 0.232814 hartree
zpe.thermalcorrener: 0.251671 hartree
zpe.thermalcorrenthalpy: 0.252615 hartree
zpe.thermalcorrgfe: 0.186474 hartree
zpe.sumelectzpe: -1948.270315 hartree
zpe.sumelectthermal: -1948.251459 hartree
zpe.sumelectthermalent: -1948.250515 hartree
zpe.sumelectthermalfe: -1948.316655 hartree
dipole: 10.3840 0.3983 -7.8968
dipole: 13.0517
quadrupole: -132.0778 -153.4478 -221.9502
quadrupole: 59.6948 4.2500 -38.6041
quadrupole: 37.0808 15.7108 -52.7916 59.6948 4.2500 -38.6041
hfenergy: -1948.5031295 hartree
pointgroup: C01 [X(C10H12N2O8Ti1)]
dipole: 4.0853881 0.1567085 -3.1068395 debye
polarizability: 286.5977822|-11.5587787|352.2490392|32.0479509|-11.3708827|301.8685897 unknown
InChI: InChI=1S/C10H12N2O8.Ti/c13-7(14)3-11(4-8(15)16)1-2-12(5-9(17)18)6-10(19)20;/h1-6H2;/q-4;+4
charge 0 multiplicity 1
33 atoms
Ti 0.04416541 5.41033466 4.36255609
O  3.23240213 7.05398239 6.26932786
O  1.53162052 5.76722645 5.57076832
O  -0.97129754 3.87482114 0.73155386
O  -0.77545717 5.07025316 2.61996291
O  0.71190228 1.76513667 5.98072279
O  -0.19781527 3.67533002 5.21870625
O  -1.5331723 9.00339335 3.38996843
O  -0.91734885 7.10027431 4.41702249
N  1.54779407 4.05275746 3.34347356
N  1.33261472 6.85560981 3.17930361
C  2.69012053 4.85629965 2.83215477
C  2.15839205 6.11581382 2.18819312
C  2.18113951 7.57090174 4.16617851
C  2.38333293 6.76558 5.42936948
C  0.83141941 3.36035043 2.24210014
C  -0.38057013 4.13605344 1.77755449
C  1.95570331 3.08026628 4.38133692
C  0.76253295 2.76091209 5.2645533
C  0.38313952 7.79676933 2.54518428
C  -0.77715025 8.04197668 3.4931699
H  3.34778362 5.0904544 3.67855968
H  3.27775222 4.27168887 2.10814496
H  1.52796131 5.88254928 1.32103184
H  2.98679287 6.74718175 1.83280792
H  3.14739817 7.85407237 3.72612419
H  1.67677024 8.49822507 4.47560952
H  1.50573581 3.15206895 1.39974403
H  0.45238071 2.39365905 2.60504907
H  2.71941958 3.5391416 5.02512549
H  2.38053328 2.1667858 3.94176896
H  -0.03330365 7.33619044 1.63798851
H  0.87020801 8.74033956 2.26068473
