program: Gaussian 16
title: Step 5 - PBEPBE-GD3MBJ-SMD(water)_def2-TZVP-TZVPD-SDD
version: ES64L-G16RevC.01
method: RPBEPBE
basis: Gen
operation: Freq
keyword: #P#
keyword: PBEPBE/CHKBASIS
keyword: #
keyword: GEOM=CHECK
keyword: GUESS=READ
keyword: NOSYMM
keyword: INT=ULTRAFINE#
keyword: EMPIRICALDISPERSION=GD3BJ
keyword: IOP(3/174=1000000,3/175=358940,3/177=12092,3/178=5938951)
keyword: SCRF=(SMD,SOLVENT=WATER)
keyword: CPHF=(GRID=FINEGRID)
keyword: #SCF=(VSHIFT=300,NOSYM,MAXCYCLE=250)
keyword: FREQ
title: #P # PBEPBE/CHKBASIS # GEOM=CHECK # GUESS=READ # NOSYMM # INT=ULTRAFIN
converged: YES YES YES YES
title: Mulliken charges:
elementType: Hf O O N C H H C H H C H H C O O N C H H C H H C H H C O O N C H H C H H C H H C O O N C H H C H H C H H C
charge: 2.045352 -0.707206 -0.642906 -0.061174 -0.151300 0.157128 0.141304 -0.128071 0.133676 0.167355 -0.155607 0.168500 0.162170 0.398557 -0.704082 -0.650474 -0.061910 -0.136947 0.153296 0.141188 -0.125342 0.133226 0.166567 -0.154391 0.168120 0.160787 0.397795 -0.696317 -0.645527 -0.056680 -0.140225 0.152199 0.140970 -0.123255 0.132326 0.165665 -0.158063 0.169119 0.160297 0.399259 -0.709481 -0.644216 -0.053803 -0.150236 0.155542 0.141386 -0.132595 0.132737 0.170003 -0.151015 0.167831 0.162195 0.396270
chargesum: -0.00000
title: Mulliken charges with hydrogens summed into heavy atoms:
elementType: Hf O O N C C C C O O N C C C C O O N C C C C O O N C C C C
charge: 2.045352 -0.707206 -0.642906 -0.061174 0.147132 0.172960 0.175064 0.398557 -0.704082 -0.650474 -0.061910 0.157536 0.174451 0.174516 0.397795 -0.696317 -0.645527 -0.056680 0.152944 0.174737 0.171353 0.399259 -0.709481 -0.644216 -0.053803 0.146693 0.170145 0.179011 0.396270
polarizability: 4.43899628e+02 -1.26609872e-01 4.40603285e+02 -1.88003842e+00 -1.33407486e+01 3.94621800e+02
1716.lowfreq: -45.8969 0.0002 0.0005 0.0008 35.5328 38.5387 46.8990 59.9354 62.5755
frequency: 46.6812 59.1016 62.2691 66.3345 103.1378 110.6092 128.1125 141.6773 142.6258 179.7455 185.1794 195.5931 207.7015 215.7127 223.8511 227.0889 236.2633 245.5349 255.6304 264.2571 268.0220 273.0321 283.3589 290.7643 301.0677 344.9158 350.6508 358.9733 368.4445 388.2357 392.9633 396.2579 398.5562 435.8360 443.9324 451.9137 456.0870 489.7532 496.4122 509.8314 519.0769 539.9589 552.7329 554.3216 561.4417 598.0963 610.3501 614.9272 638.3510 695.4442 697.7836 700.7662 703.7582 774.2725 796.3727 797.8229 838.2394 881.4751 896.8391 899.4446 901.3390 919.9493 924.1123 925.6896 927.7924 951.0833 963.2508 964.8048 965.7508 980.8848 987.5175 989.2698 1016.3020 1029.0029 1042.8160 1052.0071 1054.0354 1065.0142 1069.1337 1079.9131 1091.4425 1115.8218 1140.2149 1143.0462 1171.0283 1198.0972 1225.7607 1227.3563 1231.4646 1249.0862 1249.4735 1255.0723 1260.9707 1283.1498 1285.8669 1287.8044 1290.8207 1293.0692 1295.1366 1296.4269 1300.5001 1311.6700 1313.5768 1316.7927 1325.3988 1334.0359 1347.1066 1348.7016 1359.7919 1374.9341 1378.3700 1382.2274 1395.8218 1397.7062 1399.9314 1404.4299 1405.7586 1423.3168 1437.2933 1439.7272 1442.7440 1443.6965 1446.1930 1447.5526 1454.3823 1562.6463 1566.8813 1568.6542 1583.5636 2975.3772 2976.2992 2976.5660 2978.4753 2983.9178 2984.8818 2985.9357 2987.9074 2991.5318 2993.3985 2993.8700 2995.5454 3040.4199 3043.4656 3045.5047 3046.6372 3047.3199 3047.9172 3048.9505 3050.5257 3058.8038 3062.3220 3065.4385 3068.3762
redmass: 11.8139 11.1835 11.9100 10.6206 2.6888 7.8490 8.3533 5.7436 5.1094 7.1414 7.1560 6.0756 5.2961 4.1048 4.7008 7.4686 9.4914 6.7906 6.8634 4.7527 4.3098 2.9662 8.8189 8.5543 9.7356 2.8406 2.6971 2.7031 2.6410 4.7533 3.8604 3.2185 5.1684 2.0763 2.0440 2.2173 2.2771 2.6223 3.2713 3.4221 3.2051 2.8059 3.0917 3.1973 3.1885 2.9510 3.0401 3.0669 3.3824 6.3730 6.6118 6.4298 6.6595 2.2965 2.4456 2.4375 3.2042 2.0891 2.6334 2.4990 2.6923 4.3412 4.2544 4.3937 5.1910 2.4165 2.3846 2.3457 2.4029 1.8723 2.4093 2.4718 2.6574 3.3296 2.8745 2.7435 2.7907 3.3018 3.0702 2.9160 3.5150 2.4157 2.2013 2.1511 2.5737 1.0626 1.2988 1.2925 1.2311 1.2755 1.2937 1.3680 1.3141 1.6155 2.1527 1.7401 1.9341 1.4711 1.5031 1.3607 1.3915 2.2265 2.0762 2.6342 2.9727 1.2998 1.3014 1.2995 1.2757 1.2718 1.2395 1.2296 1.2087 1.2829 1.2590 1.2385 1.2300 1.0989 1.0842 1.0819 1.0896 1.0854 1.0919 1.0908 1.1062 11.2661 11.2136 11.2588 11.5131 1.0683 1.0682 1.0679 1.0667 1.0689 1.0676 1.0684 1.0691 1.0623 1.0620 1.0617 1.0620 1.0982 1.0958 1.1005 1.0989 1.0979 1.0995 1.0939 1.1005 1.0961 1.0949 1.0951 1.0942
irintensity: 1.3453 12.7598 14.4351 36.2765 0.2881 5.0596 1.9222 12.3606 7.6695 40.5368 4.5797 14.0967 22.2533 27.3518 41.9856 30.1410 38.9213 3.5022 1.7018 51.9602 20.1629 8.8402 109.5629 93.1129 78.8342 20.7562 37.4577 35.2765 15.7276 12.1872 16.1303 20.8218 27.4076 9.4637 13.4937 14.8250 16.3411 22.2169 40.7559 45.3520 0.3275 0.8331 25.8446 25.6284 10.1655 0.2768 3.2901 1.7400 39.8901 52.3368 80.4319 60.3251 91.9555 1.1128 52.6743 49.6966 46.4946 25.5386 26.2981 15.1647 40.8705 61.4254 251.6349 205.9671 49.0112 6.2198 2.7027 2.4440 2.2603 15.8217 56.9781 53.1178 0.1513 11.2273 0.4480 0.5404 2.9860 102.5314 103.2099 135.9946 12.5007 0.4776 5.9722 11.8949 0.1797 0.1077 45.6639 41.9747 9.8653 15.0834 21.8230 2.8257 33.9932 100.7470 510.4536 310.2723 32.6054 30.6429 111.8727 57.5377 84.1468 779.3452 211.8456 658.2704 86.7497 6.8302 16.5824 20.9741 0.7589 39.8564 8.4048 7.8838 4.1763 13.6385 10.5073 18.7469 18.8902 4.4014 30.9179 22.5178 9.3409 13.6469 4.4438 24.2411 41.9513 65.4620 1951.3202 1944.2578 937.9407 5.5158 16.2768 12.7387 6.8712 44.1613 52.4637 87.1706 94.1642 50.6902 37.8690 30.2234 26.2843 1.3232 1.0668 2.5725 2.5310 2.4017 7.3154 5.2195 3.3731 10.7147 38.3053 21.4241 49.1831
temp: 298.150 k
press: 1.00000 atm
elementType: 72 8 8 7 6 1 1 6 1 1 6 1 1 6 8 8 7 6 1 1 6 1 1 6 1 1 6 8 8 7 6 1 1 6 1 1 6 1 1 6 8 8 7 6 1 1 6 1 1 6 1 1 6
symmnumber: 1
zpe: 1092376.9 jmol-1
zpe.correction: 0.416064 hartree
zpe.thermalcorrener: 0.441862 hartree
zpe.thermalcorrenthalpy: 0.442806 hartree
zpe.thermalcorrgfe: 0.363698 hartree
zpe.sumelectzpe: -1492.617280 hartree
zpe.sumelectthermal: -1492.591483 hartree
zpe.sumelectthermalent: -1492.590539 hartree
zpe.sumelectthermalfe: -1492.669647 hartree
dipole: -1.0870 -8.0320 -30.8579
dipole: 31.9046
quadrupole: -217.0661 -202.1442 -497.7600
quadrupole: 7.0027 12.1504 -5.8690
quadrupole: 88.5906 103.5125 -192.1032 7.0027 12.1504 -5.8690
hfenergy: -1493.0333446 hartree
pointgroup: C01 [X(C16H24Hf1N4O8)]
dipole: -0.4276475 -3.1600449 -12.1404204 debye
polarizability: 443.8996278|-0.1266099|440.6032851|-1.8800384|-13.3407486|394.6218003 unknown
InChI: InChI=1S/C16H24N4O8.Hf/c21-13(22)9-17-1-2-18(10-14(23)24)5-6-20(12-16(27)28)8-7-19(4-3-17)11-15(25)26;/h1-12H2;/q-4;+4
charge 0 multiplicity 1
53 atoms
Hf -0.53172211 -0.80155374 5.22050876
O  0.97325197 0.6224472 5.78133712
O  1.92299192 2.65062808 5.64605165
N  -0.24724709 0.81191699 3.3815686
C  0.69337991 0.26296516 2.36409667
H  0.14672187 -0.45930998 1.74715025
H  1.03059023 1.07296637 1.69662109
C  -1.55083013 1.08778611 2.71816468
H  -1.38711707 1.54846107 1.73032811
H  -2.10149622 1.81817069 3.32281884
C  0.31141299 2.0480497 3.97739842
H  0.89337104 2.6184314 3.23756485
H  -0.51659721 2.68837462 4.31225574
C  1.15276633 1.77913643 5.2124956
O  0.74363203 -2.05687433 6.45422734
O  2.75338144 -2.88006557 7.01993385
N  1.44583257 -1.4748107 3.93689882
C  1.11986644 -2.6926443 3.14017622
H  0.5294913 -2.37967541 2.2707174
H  2.0503839 -3.14378509 2.75816018
C  1.88474595 -0.39384711 3.01277405
H  2.5567354 -0.80064194 2.23934611
H  2.46483201 0.33662148 3.58984133
C  2.52905944 -1.78237888 4.9005113
H  3.25185739 -2.49298784 4.47131007
H  3.07262726 -0.85592831 5.13301331
C  1.99770121 -2.29958395 6.22231983
O  -1.74241762 0.88473998 5.77285465
O  -3.72486333 1.91334269 5.98533265
N  -2.59799477 -0.83393979 3.87962522
C  -2.34096569 -0.18914004 2.56216367
H  -1.79417477 -0.90690216 1.9382249
H  -3.29868018 0.02268122 2.05880828
C  -3.07620949 -2.22497739 3.659685
H  -3.7956122 -2.25476047 2.82479545
H  -3.6143837 -2.55166205 4.55770528
C  -3.61657065 -0.05966816 4.6306023
H  -4.35810749 0.38482668 3.94932168
H  -4.15411149 -0.74012398 5.30557136
C  -3.01123459 1.01104228 5.51836597
O  -1.99327139 -1.72034797 6.49923701
O  -2.91254746 -3.52142014 7.47147758
N  -0.90906246 -3.11514328 4.46796752
C  -1.91417307 -3.13909861 3.36853302
H  -1.41248955 -2.83257912 2.44318526
H  -2.27540292 -4.16979111 3.21924053
C  0.35712766 -3.7083129 3.95698724
H  0.14113252 -4.59451089 3.33792807
H  0.94985446 -4.05398524 4.81200873
C  -1.41344125 -3.87429475 5.63487365
H  -2.03160976 -4.72781814 5.31735883
H  -0.55774605 -4.27426696 6.19609814
C  -2.18386753 -3.00315783 6.61055783
