program: Gaussian 16
title: Title Card Required
version: ES64L-G16RevC.01
frameworkgroup: C1[X(C19H27O)]
method: UM062X
basis: 6-31G(d,p)
operation: Freq
keyword: #N
keyword: Geom=AllCheck
keyword: Guess=TCheck
keyword: SCRF=Check
keyword: GenChk
keyword: UM062X/6-31G(d,p)Freq
converged: YES YES YES YES
elementType: C
elementType: H
elementType: O
1716.lowfreq: -437.1636 -0.0007 -0.0006 0.0003 3.4389 7.2773 12.4360 31.3562 55.4087
frequency: -437.1635 31.1256 55.3385 70.8935 92.0544 126.3346 153.5037 189.8324 197.3946 207.9540 236.9315 243.3339 257.0802 264.5870 273.7327 309.3359 313.5784 326.5072 334.9352 357.0707 371.9625 382.2605 405.1547 415.6177 431.0595 442.0281 460.0510 479.9611 502.8039 523.9428 550.9161 592.7491 614.0168 631.9855 667.0966 705.0809 752.9679 766.4857 795.3884 828.6313 832.2731 855.9676 881.1364 885.0847 915.1329 922.2365 933.5963 934.6463 943.1040 968.4601 974.4514 980.4350 1001.3944 1011.6139 1016.6147 1030.7691 1036.3215 1053.2450 1064.8861 1069.1000 1101.0662 1125.1239 1137.3582 1153.2724 1164.1858 1168.6942 1186.9758 1191.5466 1203.5559 1210.1026 1226.6494 1256.4848 1266.1521 1268.4709 1276.4998 1293.0865 1302.8819 1320.3019 1334.3589 1337.5597 1351.3753 1360.7241 1367.1605 1375.7539 1381.1006 1403.8619 1407.2211 1411.0901 1416.2496 1418.1276 1422.0927 1433.1076 1441.5246 1476.9093 1497.7019 1499.1350 1504.8873 1507.9314 1512.1902 1515.0127 1518.1840 1521.2049 1524.9017 1528.0793 1530.4401 1544.1159 1724.9471 1780.7779 3025.0287 3044.9197 3048.7185 3062.9536 3065.0232 3068.3810 3068.5577 3071.9452 3075.9327 3081.6571 3087.1427 3119.0174 3128.7118 3137.3818 3138.7013 3141.3261 3142.6683 3145.5354 3148.8138 3158.4022 3161.3612 3161.5266 3165.4912 3207.9195 3230.6339 3231.5019 3250.6097
redmass: 7.9477 3.1687 3.6080 5.2079 2.8655 2.5501 3.0164 2.9846 2.6500 2.3509 1.3606 1.4657 2.4238 1.5716 1.8472 2.8744 1.7295 1.4995 2.5071 2.0882 2.6902 3.0652 2.4127 2.6521 2.4939 2.7675 3.8128 2.5411 3.0390 2.6469 3.4341 3.8215 4.9180 2.6306 2.5323 2.7110 1.4969 1.8941 5.3438 2.4758 1.7230 2.0538 2.0085 2.3257 1.8362 1.4357 1.4014 1.7061 1.6415 1.5808 1.5122 1.4938 2.5967 2.9054 1.7303 1.5081 1.4010 1.9627 1.9820 2.4440 2.0465 1.5117 2.0121 1.9774 1.8388 1.9205 1.2600 1.9871 1.8022 2.0483 1.7779 1.3936 1.6649 1.6289 1.6533 1.3803 1.8962 1.6769 1.6284 1.3646 1.4623 1.4293 1.7109 1.5194 1.7596 1.6300 1.4738 1.2903 1.4352 1.3944 1.3739 1.2474 2.9353 1.0814 1.0586 1.0731 1.0600 1.0502 1.0522 1.0807 1.0817 1.0583 1.0831 1.0679 1.0559 5.1482 8.5581 9.7356 1.0829 1.0719 1.0837 1.0444 1.0383 1.0525 1.0407 1.0687 1.0582 1.0661 1.0662 1.0993 1.0917 1.1001 1.1004 1.0999 1.1003 1.0994 1.1009 1.1020 1.1015 1.1025 1.0982 1.0860 1.0957 1.0896 1.0915
irintensity: 22.1627 0.2636 0.7939 2.8739 0.3398 0.1143 0.2271 0.3630 0.2965 1.1293 0.1552 0.1394 0.2701 0.0564 0.4277 0.0626 0.1416 0.2275 0.6077 0.5105 0.4760 1.5778 0.1566 3.4162 0.6760 0.6442 8.0339 0.2073 3.4089 1.6837 4.6513 1.5993 0.2682 0.9381 7.7222 0.5245 2.9770 4.6437 1.7163 4.6572 0.5470 15.2596 39.9468 0.7917 2.4145 0.6687 0.2859 1.4796 6.3789 0.2365 2.5705 3.2228 0.1162 3.3895 5.2697 8.2434 0.5104 6.1587 2.7147 0.7825 2.2299 0.1733 1.5174 3.0631 3.4069 1.8779 16.8752 3.7898 3.6418 0.9946 0.3205 5.2448 28.4306 0.1745 11.7597 0.3884 4.4827 0.9131 1.6140 2.2736 1.0921 0.9257 9.2829 5.3342 4.0046 6.5179 3.1161 7.9342 0.8839 17.0501 2.5817 4.2130 33.6763 5.6409 1.3941 0.3300 3.5930 8.2191 2.8898 6.9924 4.2914 1.3564 4.5175 11.6579 8.3565 31.0792 51.6890 380.2823 7.0419 16.4422 14.3186 13.1760 20.2210 15.7581 19.5025 3.2695 42.3328 37.6471 20.7982 30.2902 2.1750 2.7247 18.9734 31.8888 73.0156 11.7871 24.0106 21.6569 15.5599 32.7450 30.8516 3.9202 8.9898 5.5470 5.9620
temp: 298.150 k
press: 1.00000 atm
elementType: 6 6 6 6 6 1 1 1 1 6 8 6 6 1 6 1 1 6 6 1 1 6 1 1 1 6 1 1 1 6 1 6 1 6 1 1 6 1 6 1 1 1 6 1 1 1 1
symmnumber: 1
zpe: 1106199.7 jmol-1
zpe.correction: 0.421329 hartree
zpe.thermalcorrener: 0.440046 hartree
zpe.thermalcorrenthalpy: 0.440990 hartree
zpe.thermalcorrgfe: 0.375503 hartree
zpe.sumelectzpe: -814.659079 hartree
zpe.sumelectthermal: -814.640362 hartree
zpe.sumelectthermalent: -814.639418 hartree
zpe.sumelectthermalfe: -814.704905 hartree
dipole: -3.9444 4.2780 0.8874
dipole: 5.8862
quadrupole: -136.1410 -131.8143 -120.1296
quadrupole: 15.8935 4.2929 -2.0009
quadrupole: -6.7794 -2.4526 9.2320 15.8935 4.2929 -2.0009
hfenergy: -815.0804081 hartree
pointgroup: C01 [X(C19H27O1)]
dipole: -1.5495863 1.6856967 0.3466283 debye
polarizability: 233.1109149|-24.3396547|205.3240338|-2.2442004|8.1755049|159.425029 unknown
InChI: InChI=1S/C19H27O/c1-13(2)16-5-6-17-18(16,4)10-7-14(3)19(17)11-8-15(20)9-12-19/h8-9,11-14,16H,5-7,10H2,1-4H3
charge 0 multiplicity 2
47 atoms
C  1.91296869 -1.44588087 -1.29562602
C  1.20712008 -0.27593533 -1.16254615
C  2.60064974 0.34310996 0.81549829
C  3.30952468 -0.77851513 0.65865396
C  3.00102615 -1.78804157 -0.39231198
H  1.71546563 -2.13170863 -2.11241609
H  0.52670812 0.02975651 -1.94876826
H  2.84708154 1.02936153 1.62111986
H  4.14777883 -1.01736432 1.30636773
C  1.40999615 0.69232081 -0.0309866
O  3.65192795 -2.82347052 -0.47980738
C  0.13698022 0.08091461 0.4743721
C  1.33373906 2.17601004 -0.5025626
H  1.83468354 2.18464848 -1.47771251
C  -0.10551586 2.71125796 -0.69129635
H  -0.3728901 3.29018568 0.20083262
H  -0.100729 3.43171111 -1.51559351
C  -1.24063786 0.64698857 0.21952981
C  -1.21241159 1.67603699 -0.91843676
H  -1.0972966 1.17206946 -1.88460261
H  -2.16623266 2.20701485 -0.97086357
C  2.09452926 3.14585905 0.40538895
H  3.16595321 2.93502861 0.433639
H  1.96315921 4.16801913 0.03888754
H  1.70632756 3.11058172 1.43018763
C  -1.72317807 1.32186868 1.52652135
H  -1.83447462 0.5898351 2.33150654
H  -1.01600924 2.0816378 1.86940784
H  -2.69478817 1.80401767 1.37361617
C  -2.04944672 -0.66085181 -0.02871113
H  -1.80963128 -0.98110767 -1.05511915
C  0.01097408 -1.16904966 1.28791869
H  0.78169609 -1.90340134 1.04018652
C  -1.4150948 -1.67679923 0.96074153
H  -1.38516646 -2.67914483 0.52792658
H  -2.02502489 -1.74320148 1.86905468
C  -3.5804448 -0.61561518 0.09479848
H  -3.82879904 -0.35051598 1.13285515
C  -4.23566579 0.40920723 -0.83362409
H  -4.03040782 1.43758471 -0.5282005
H  -3.88050418 0.28406628 -1.86326521
H  -5.32221943 0.28109772 -0.8387356
C  -4.1653946 -2.00411366 -0.18618155
H  -3.78065308 -2.76034803 0.50243181
H  -5.25517784 -1.99058979 -0.09443347
H  -3.91971351 -2.32101655 -1.20652241
H  0.12699326 -0.94926873 2.3585282
