program: Orca
programVersion: 5.0.4
elementType: O C C C C C C H H H H H H
charge: 1
multiplicity: 2
keywords: SP DSD-BLYP D3BJ def2-QZVPP def2-QZVPP/C def2/J TightSCF keepdens
formula: C6H6O
InChI: InChI=1S/C6H6O/c7-6-4-2-1-3-5-6/h1-5,7H
13 atoms
O  2.261086 -0.145122 -0.124218
C  0.914456 -0.083588 -0.052092
C  0.1069 -1.216415 -0.074241
C  -1.271848 -1.085935 0.004429
C  -1.857876 0.165364 0.105494
C  -1.045662 1.291733 0.12678
C  0.331147 1.176374 0.048738
H  2.544622 -1.05985 -0.19483
H  0.548753 -2.204406 -0.152227
H  -1.889188 -1.974533 -0.013399
H  -2.932877 0.263711 0.166857
H  -1.489419 2.275663 0.204854
H  0.964788 2.053368 0.064561
totalener: -306.33536511 hartree
nucrepener: 272.57854638 hartree
electener: -578.91391149 hartree
oneelecener: -943.89947782 hartree
twoeener: 364.98556633 hartree
kineticenergy: 305.61096788 hartree
exchangeener: -12.824785213339 hartree
correlationener: -0.895263503488 hartree
xcener: -13.720048716827 hartree
s2: 0.833920
chargesum: 1.0000000
charge: -0.260517 0.262735 0.013261 -0.042951 0.006146 -0.035101 0.007557 0.296968 0.122673 0.151987 0.159197 0.149867 0.168178
charge: 0.815910 -0.222078 0.151951 0.154443 0.197063 0.147310 0.176368 -0.291060 -0.032265 -0.026074 -0.021618 -0.028099 -0.021851
qa: -0.2605 0.2627 0.0133 -0.0430 0.0061 -0.0351 0.0076 0.2970 0.1227 0.1520 0.1592 0.1499 0.1682
va: 2.3340 3.7946 3.7474 3.8190 3.8001 3.7908 3.7496 0.9696 0.9844 0.9739 0.9685 0.9747 0.9710
total: -306.929410893 hartree
dispcorr: -0.008108162 hartree
energy: -306.937519055036
dipole: -2.08046 1.73875 -0.34171 -0.60826 0.05929 -0.54897 0.06929 -0.08562 -0.01633
magnitude: 0.64684 au
magnitude: 1.64413 debye
