program: Orca
programVersion: 5.0.4
elementType: C C H C H C H C H C H C H H K Zn N Si C H H H C H H H C H H H Si C H H H C H H H C H H H N Si C H H H C H H H C H H H Si C H H H C H H H C H H H C C H C H C H C H C H C H H H
charge: +1
multiplicity: 2
keywords: SP DSD-BLYP D3BJ def2-QZVPP def2-QZVPP/C def2/J TightSCF keepdens
formula: C26H51N2KSi4Zn
InChI: InChI=1S/C7H8.C7H7.2C6H18NSi2.K.Zn/c2*1-7-5-3-2-4-6-7;2*1-8(2,3)7-9(4,5)6;;/h2-6H,1H3;2-6H,1H2;2*1-6H3;;
85 atoms
C  1.494328 16.947784 14.665775
C  2.736125 17.398156 14.24572
H  3.284424 16.827146 13.759421
C  3.183092 18.679294 14.530273
H  4.023268 18.953379 14.241204
C  2.376825 19.54723 15.24542
H  2.679539 20.402706 15.450178
C  1.132755 19.144408 15.650419
H  0.578838 19.734106 16.111124
C  0.696625 17.852887 15.373394
H  -0.145498 17.587108 15.665475
C  1.03148 15.574661 14.358638
H  0.402527 15.307221 15.04819
H  1.795345 14.97915 14.420367
K  2.941869 16.873242 17.31513
Zn 4.525812 15.862658 20.097125
N  4.493643 17.764225 19.445965
Si 3.366455 18.805124 20.1849
C  1.632124 18.361605 19.674812
H  1.514589 17.410614 19.736541
H  1.005843 18.799726 20.255963
H  1.48198 18.643996 18.769964
C  3.522673 20.58543 19.667284
H  4.367441 20.932188 19.963882
H  3.470363 20.647722 18.709741
H  2.811219 21.0983 20.058733
C  3.385854 18.749892 22.037055
H  4.273396 18.938844 22.353225
H  2.777577 19.408111 22.38183
H  3.118247 17.877804 22.333652
Si 6.087928 18.286647 19.047591
C  6.147005 19.190089 17.425488
H  5.598308 19.977044 17.478183
H  7.052303 19.445486 17.23428
H  5.819972 18.619079 16.728408
C  6.884643 19.387347 20.33877
H  6.349305 20.174302 20.462226
H  6.949464 18.911851 21.169845
H  7.762849 19.640668 20.045183
C  7.259402 16.827146 18.845242
H  6.790661 16.096253 18.437232
H  7.996675 17.084619 18.288181
H  7.586535 16.55929 19.706429
N  3.611235 14.578612 18.891463
Si 2.257395 13.850003 19.642141
C  1.795025 14.767357 21.225551
H  2.518862 14.707141 21.853375
H  1.625253 15.691355 21.023805
H  1.007237 14.372841 21.606461
C  2.556397 12.09503 20.192729
H  2.848277 11.569701 19.442954
H  3.23229 12.082572 20.873248
H  1.741891 11.725431 20.543527
C  0.753074 13.916033 18.545633
H  0.947045 13.482065 17.711547
H  0.023641 13.465454 18.977733
H  0.514508 14.829649 18.384537
Si 4.522126 13.732271 17.726753
C  5.060877 14.852489 16.327926
H  5.505346 15.622834 16.687758
H  5.662112 14.376994 15.749787
H  4.290295 15.132803 15.828076
C  6.050617 12.940125 18.437232
H  6.613521 13.619108 18.819648
H  5.798865 12.313052 19.119256
H  6.52825 12.483317 17.741658
C  3.559063 12.398184 16.815731
H  3.41301 11.652757 17.402904
H  2.712971 12.751172 16.531178
H  4.05937 12.109565 16.049395
C  5.864103 14.198216 22.193634
C  7.105901 13.747844 21.773579
H  7.654199 14.318854 21.28728
C  7.552868 12.466706 22.058133
H  8.393043 12.192621 21.769063
C  6.746601 11.59877 22.773279
H  7.049315 10.743294 22.978037
C  5.502531 12.001592 23.178278
H  4.948614 11.411894 23.638983
C  5.066401 13.293113 22.901253
H  4.224277 13.558892 23.193334
C  5.401255 15.571339 21.886497
H  4.772302 15.838779 22.576049
H  6.16512 16.16685 21.948226
H  0.580125 15.536729 13.37821
totalener: -4662.16384758 hartree
nucrepener: 6246.77948702 hartree
twoeener: 7954.55541129 hartree
kineticenergy: 4669.12022399 hartree
exchangeener: -109.599134099694 hartree
correlationener: -6.380983033235 hartree
xcener: -115.980117132929 hartree
s2: 0.891138
chargesum: 1.0000000
charge: 0.040276 -0.138820 0.142230 -0.157782 0.139988 -0.116957 0.155296 -0.161878 0.143261 -0.137201 0.133209 -0.203932 0.076540 0.075595 0.575400 1.262034 -0.703423 0.720963 -0.407233 0.043457 0.080187 0.036115 -0.424421 0.083875 0.055618 0.074239 -0.384163 0.081989 0.073953 0.036186 0.733884 -0.385797 0.073195 0.075450 0.041116 -0.393300 0.074143 0.054021 0.074392 -0.437680 0.030583 0.091373 0.086725 -0.686367 0.786614 -0.459256 0.052915 0.076241 0.089850 -0.416998 0.070184 0.053646 0.079260 -0.399860 0.070753 0.077497 0.046103 0.650347 -0.372326 0.066632 0.069765 0.002306 -0.376735 0.036741 0.080211 0.073496 -0.448885 0.094522 0.068361 0.078508 0.137529 -0.111159 0.123047 -0.144272 0.146055 -0.053665 0.147756 -0.142448 0.151160 -0.125939 0.134147 -0.293698 0.054992 0.106850 0.093412
charge: 0.000613 0.232777 -0.177766 0.250960 -0.177936 0.232360 -0.180069 0.241335 -0.176080 0.241518 -0.179354 0.404420 -0.130540 -0.132295 -0.415615 0.022435 0.306308 -0.043029 0.498079 -0.144886 -0.138695 -0.137729 0.460189 -0.160680 -0.159080 -0.151461 0.457746 -0.156514 -0.150924 -0.164015 -0.012557 0.463416 -0.155433 -0.151605 -0.158312 0.454205 -0.163097 -0.164825 -0.155486 0.464874 -0.162678 -0.148314 -0.160866 0.304181 -0.027642 0.463059 -0.163710 -0.159523 -0.149707 0.454484 -0.162451 -0.165126 -0.155101 0.468243 -0.158364 -0.151574 -0.157201 -0.019744 0.495878 -0.144970 -0.139802 -0.138885 0.454541 -0.164467 -0.157602 -0.154682 0.458973 -0.162814 -0.164357 -0.154428 0.006602 0.241764 -0.182701 0.247538 -0.183667 0.251593 -0.176545 0.236863 -0.181561 0.253565 -0.184342 0.394077 -0.136282 -0.134912 -0.020593
qa: 0.0403 -0.1388 0.1422 -0.1578 0.1400 -0.1170 0.1553 -0.1619 0.1433 -0.1372 0.1332 -0.2039 0.0765 0.0756 0.5754 1.2620 -0.7034 0.7210 -0.4072 0.0435 0.0802 0.0361 -0.4244 0.0839 0.0556 0.0742 -0.3842 0.0820 0.0740 0.0362 0.7339 -0.3858 0.0732 0.0754 0.0411 -0.3933 0.0741 0.0540 0.0744 -0.4377 0.0306 0.0914 0.0867 -0.6864 0.7866 -0.4593 0.0529 0.0762 0.0899 -0.4170 0.0702 0.0536 0.0793 -0.3999 0.0708 0.0775 0.0461 0.6503 -0.3723 0.0666 0.0698 0.0023 -0.3767 0.0367 0.0802 0.0735 -0.4489 0.0945 0.0684 0.0785 0.1375 -0.1112 0.1230 -0.1443 0.1461 -0.0537 0.1478 -0.1424 0.1512 -0.1259 0.1341 -0.2937 0.0550 0.1068 0.0934
va: 3.6506 3.7154 0.9842 3.8629 0.9969 3.7911 0.9684 3.8553 0.9870 3.7382 0.9836 3.8785 0.9967 0.9930 0.5401 1.2452 2.7699 4.0011 3.7831 1.0229 1.0379 1.0174 3.8451 1.0240 1.0262 1.0357 3.8455 1.0238 1.0389 1.0281 3.9624 3.8309 1.0241 1.0348 1.0224 3.8284 1.0261 1.0235 1.0317 3.8148 1.0289 1.0314 0.9966 2.7879 3.9103 3.8082 1.0159 1.0249 1.0361 3.8233 1.0294 1.0372 1.0276 3.8156 1.0299 1.0329 1.0252 4.0817 3.7954 1.0176 1.0411 1.0219 3.8282 1.0365 1.0154 1.0252 3.8520 1.0103 1.0170 1.0332 3.5517 3.7302 1.0008 3.8537 0.9765 3.7981 0.9695 3.8323 0.9697 3.7744 0.9796 3.6011 1.0297 0.9954 1.0044
total: -4665.460143881 hartree
dispcorr: -0.108219797 hartree
energy: -4665.568363677539
dipole: -3.65832 3.97375 0.31543 -0.52170 -0.45301 -0.97471 -7.15982 7.58036 0.42054
magnitude: 1.10743 au
magnitude: 2.81488 debye
