program: Gaussian 16
title: Na-PMDETA-HTMP-allyletherZ TS
version: ES64L-G16RevC.01
frameworkgroup: C1[X(C27H51N4NaO)]
method: RwB97XD
basis: Gen
operation: Freq
keyword: #P
keyword: Geom=AllCheck
keyword: Guess=TCheck
keyword: SCRF=Check
keyword: GenChk
keyword: RwB97XD/ChkBas
keyword: Freq
converged: YES YES YES YES
title: Mulliken charges:
elementType: N N N C H H H C C H H C H H C H H H C H H C H H C H H H Na H H H C H H H C C C C H H H H H H H H C C C C C H H H H H H H H H H N H C C C C C C H H H H H O C H C H C H H
charge: -0.603267 -0.598627 -0.671118 -0.199540 0.140375 0.147310 0.170572 -0.059032 -0.075249 0.139508 0.127971 -0.084061 0.140619 0.147236 -0.190557 0.158152 0.140597 0.120622 -0.056926 0.138600 0.111727 -0.193742 0.136373 0.178624 -0.201894 0.123520 0.142433 0.156518 0.552972 0.133386 0.137397 0.133182 -0.202104 0.150209 0.138752 0.157990 0.194567 0.183894 -0.354307 -0.342173 0.124753 0.126254 0.116577 0.101909 0.091899 0.086465 0.116540 0.163202 -0.201038 -0.334630 -0.197164 -0.330746 -0.223680 0.082809 0.106627 0.101560 0.094665 0.082612 0.097283 0.098088 0.097319 0.103801 0.091730 -0.795442 0.290004 -0.131844 -0.156452 0.376513 -0.178243 -0.127152 -0.129960 0.118388 0.134286 0.122376 0.115755 0.111909 -0.554005 0.055574 0.090031 -0.064936 0.045697 -0.489847 0.121033 0.078975
chargesum: -0.00000
title: Mulliken charges with hydrogens summed into heavy atoms:
elementType: N N N C C C C C C C C Na C C C C C C C C C C N C C C C C C O C C C
charge: -0.603267 -0.598627 -0.671118 0.258717 0.211751 0.192230 0.203794 0.228815 0.193400 0.254437 0.220576 0.552972 0.244847 0.194567 0.183894 -0.029291 0.009403 0.006524 -0.031778 0.011701 -0.038056 -0.028150 -0.505438 -0.013456 -0.022166 0.376513 -0.055867 -0.011397 -0.018051 -0.554005 0.145605 -0.019239 -0.289840
chargesum: 0.00000
polarizability: 4.09536606e+02 -1.88409584e+01 3.40557908e+02 -1.18268542e+01 -1.46459110e+01 2.92384589e+02
1716.lowfreq: -1411.4986 -3.4006 0.0005 0.0008 0.0010 3.7838 6.2442 12.3165 21.1602
frequency: -1411.4986 11.9034 21.0356 23.0234 32.5511 48.4273 58.8133 61.5037 69.9431 77.2926 79.5923 89.9261 97.6852 101.5614 105.7944 112.6448 123.8410 127.6573 152.1887 153.1232 163.0414 169.0836 176.0032 183.9199 201.4357 209.5802 219.4022 227.4821 236.8491 242.8024 252.6784 262.1696 271.8216 279.8932 284.3116 285.2801 288.9061 295.1416 305.2469 313.6281 322.1315 324.7785 332.7607 346.5879 372.4465 373.9092 382.4004 394.0887 403.9850 411.7497 421.1025 426.4769 429.0570 429.4186 432.1005 451.4989 462.5429 463.1527 483.3357 487.0458 499.5264 509.2293 524.4934 572.4315 588.7168 598.5954 599.2412 617.5626 632.8692 642.5919 710.5605 712.3969 735.5650 738.2259 776.2160 781.2634 787.5858 810.3429 825.3263 854.2737 861.9911 867.8394 876.7910 909.9661 921.9697 923.3655 929.0427 938.9245 941.3706 944.7819 963.6708 972.2951 980.0285 982.0490 987.1638 1001.6403 1004.7308 1005.8829 1012.9968 1018.7818 1022.9310 1023.1722 1051.4039 1061.5337 1070.7006 1073.0524 1076.3585 1079.5093 1083.0879 1083.2946 1085.8330 1087.2899 1109.1304 1110.3564 1115.1782 1122.5235 1135.6783 1136.5037 1164.1893 1169.9969 1173.5513 1183.6976 1190.8326 1194.1215 1199.1578 1208.7579 1227.9616 1229.2707 1230.2040 1246.4470 1262.3440 1265.0095 1273.7228 1282.5803 1286.5113 1294.4180 1311.0727 1316.8962 1322.6577 1331.0513 1333.1068 1335.6328 1343.0622 1349.8995 1359.9396 1371.5806 1377.9677 1389.4301 1396.6712 1397.4163 1405.8824 1408.1315 1415.2869 1417.0641 1418.6025 1426.7174 1441.0927 1448.6661 1462.4567 1462.7947 1476.3311 1477.4963 1484.7496 1487.0913 1491.1584 1491.5933 1493.3533 1495.7887 1496.8052 1497.7053 1499.9831 1501.0894 1504.4027 1504.8915 1506.7791 1508.8061 1512.1543 1512.9775 1514.3816 1514.9479 1516.4605 1519.0400 1520.7941 1524.7475 1527.4352 1530.2934 1531.2665 1534.5282 1543.3257 1545.2110 1554.0122 1613.7175 1676.9660 1690.3159 1694.1585 1732.9915 2955.7738 2963.1441 2974.5508 2976.7008 2977.9123 2980.5236 2981.5825 2983.4814 2990.1988 3037.9011 3040.0855 3040.8689 3050.0409 3054.8223 3058.5169 3068.1023 3072.8298 3088.6005 3090.4135 3098.7108 3101.7402 3106.0513 3112.5082 3114.0725 3114.7969 3115.3617 3120.7465 3121.2843 3126.7323 3129.1328 3129.3219 3140.5393 3143.2389 3144.3109 3156.5985 3162.4008 3166.3866 3169.6616 3170.9357 3174.8879 3180.8231 3183.9223 3190.7605 3192.9993 3205.3466 3209.4334 3213.8715 3230.3149 3239.0001 3243.1232
redmass: 1.0589 4.6404 4.5884 4.4615 3.6629 3.4998 3.5840 4.8390 3.2298 3.9674 3.2716 4.3804 3.9377 4.8256 2.9804 3.8864 3.0998 3.6646 2.3835 2.2237 3.0222 3.8272 1.3255 3.7313 2.7376 2.1562 3.0529 3.5312 2.0951 1.8884 1.1048 1.3128 1.3460 1.5141 1.5590 1.5935 1.8703 2.0438 2.5853 1.3869 1.5777 1.8801 2.0126 2.3097 2.4161 2.5999 2.0640 2.3657 2.3829 2.4886 3.6316 2.0085 2.2423 2.4743 2.0165 1.9915 2.2454 2.2053 2.1048 2.2930 3.0038 2.7607 2.7913 1.6930 2.5067 3.0794 2.3617 2.9130 6.1479 3.2802 3.1162 2.1376 2.6720 1.5397 2.8662 1.6086 2.2570 2.5128 3.0783 1.4647 3.0200 2.1413 1.5034 3.0113 1.4678 1.9321 1.9269 1.4970 1.5131 1.2146 1.6586 2.2660 1.5521 2.1969 1.3337 2.6770 1.2754 1.3254 1.5027 1.7480 2.1911 4.3146 2.0719 2.0266 2.1808 1.8331 1.9286 1.6139 1.4537 1.6421 1.7457 1.4656 1.4642 1.8185 1.4154 1.7596 1.3502 1.2884 1.4525 1.7453 1.8929 1.6956 1.1662 1.4234 1.1495 1.6998 1.9291 2.3726 2.2259 3.2313 1.9679 2.0432 2.8935 1.6084 2.2678 2.2221 1.7684 2.0648 2.3742 1.5916 1.4111 1.3595 1.7274 1.5969 1.4483 3.2580 1.4458 1.5791 1.3354 1.4472 1.3358 1.3993 1.2504 1.2881 1.3373 1.2404 1.4916 1.4221 1.1685 1.1625 1.1590 1.1827 1.1052 1.0673 1.1124 1.0779 1.0712 1.0833 1.0676 1.0788 1.0788 1.0566 1.0600 1.0965 1.0665 1.0648 1.0721 1.0767 2.2671 1.0906 1.0985 1.0666 1.0818 1.0757 1.0720 1.0813 1.0743 1.0568 1.0630 1.0545 2.5057 1.0603 6.3656 1.2772 3.6138 5.0329 1.0725 1.0714 1.0578 1.0561 1.0691 1.0577 1.0565 1.0621 1.0734 1.0457 1.0507 1.0525 1.0623 1.0459 1.0595 1.0474 1.0594 1.0998 1.0881 1.1026 1.0880 1.0785 1.0956 1.0960 1.1003 1.0896 1.0782 1.0809 1.0981 1.0813 1.0794 1.0988 1.0944 1.0884 1.1036 1.0835 1.0977 1.0995 1.1036 1.1000 1.1000 1.0988 1.0952 1.0956 1.0855 1.0938 1.0899 1.0937 1.0961 1.0952
irintensity: 6689.5555 0.6943 0.1267 0.6501 0.1243 0.0866 1.2069 1.9127 0.2569 2.4081 0.7845 1.0149 1.9962 2.1042 1.9906 0.8311 0.6368 1.0622 1.1062 0.7586 2.0790 16.7292 0.7843 8.4129 25.1385 0.2891 1.7298 6.3791 8.4431 14.0710 0.2249 1.3813 2.3725 1.0137 1.0619 1.9614 7.4622 3.9313 6.4045 0.4982 1.9624 0.3676 0.6281 0.6273 2.8782 4.4130 3.8220 0.5766 1.2245 0.2761 0.2523 7.2865 2.5760 1.9579 11.8743 2.0792 7.5472 2.0410 2.6073 1.4356 0.1642 9.4813 5.4094 7.7587 6.2341 1.1658 9.2832 4.1221 1.1733 10.7916 6.4610 17.5381 32.7585 33.5407 0.2499 49.2139 10.5699 19.3938 29.0963 4.2284 14.6256 12.8549 0.4189 9.5071 6.4615 11.4170 0.0919 0.5689 0.2658 11.9342 1.2266 22.5756 2.6835 15.2643 0.0344 53.4736 4.1978 0.7200 2.1167 78.8506 14.0315 11.6001 5.6349 4.4598 11.1589 21.4674 5.5046 0.7696 13.9884 1.9248 40.7150 12.5796 2.9170 25.3581 8.9822 4.2436 3.4668 2.3378 11.3255 28.8475 38.6350 8.7360 5.0006 17.8800 21.6613 23.4931 11.4742 1.0586 4.1832 22.2877 10.8945 11.8686 5.4489 91.3709 19.1618 43.6287 3.5575 5.5142 309.1341 3.0555 8.3673 7.6364 1.4891 19.7848 23.1654 29.0101 0.1685 2.1730 4.2711 4.0024 7.4219 22.0124 28.9636 74.4697 10.0223 12.0730 8.2855 1.9661 1.1851 0.0916 8.4621 5.6247 1.5894 0.5690 2.7655 1.1497 2.1777 8.0169 0.7994 5.8798 3.8903 16.6852 1.3854 3.8023 10.8874 14.8905 13.9898 5.3240 2.6643 11.6806 11.1145 10.9906 19.8678 12.4906 7.3335 26.8889 7.3777 23.0796 16.6417 5.7653 198.2080 14.3889 18.7338 15.0794 141.4015 34.6938 39.1592 15.1404 26.8019 24.7443 22.0473 165.6846 128.4856 102.9312 165.3643 29.3705 58.8753 29.9102 24.5186 76.4255 26.6965 54.9921 48.2858 45.4089 11.5180 29.5404 11.3569 26.5420 33.8708 25.7425 47.7147 35.1540 4.5679 43.6440 68.8489 13.9768 26.0056 13.9709 48.0338 31.9622 16.6991 21.9621 26.3700 13.9367 5.2131 18.9641 9.9849 19.2956 51.3203 57.9182 4.7897 2.9186 14.4975 35.7297 12.4634 2.0679
temp: 298.150 k
press: 1.00000 atm
elementType: 7 7 7 6 1 1 1 6 6 1 1 6 1 1 6 1 1 1 6 1 1 6 1 1 6 1 1 1 11 1 1 1 6 1 1 1 6 6 6 6 1 1 1 1 1 1 1 1 6 6 6 6 6 1 1 1 1 1 1 1 1 1 1 7 1 6 6 6 6 6 6 1 1 1 1 1 8 6 1 6 1 6 1 1
symmnumber: 1
zpe: 1988829.1 jmol-1
zpe.correction: 0.757505 hartree
zpe.thermalcorrener: 0.795752 hartree
zpe.thermalcorrenthalpy: 0.796696 hartree
zpe.thermalcorrgfe: 0.687554 hartree
zpe.sumelectzpe: -1514.973011 hartree
zpe.sumelectthermal: -1514.934764 hartree
zpe.sumelectthermalent: -1514.933819 hartree
zpe.sumelectthermalfe: -1515.042962 hartree
dipole: -6.8215 -6.4308 -0.8278
dipole: 9.4114
quadrupole: -200.3399 -202.3591 -204.8894
quadrupole: 9.8584 0.2561 -2.3382
quadrupole: 2.1896 0.1704 -2.3600 9.8584 0.2561 -2.3382
hfenergy: -1515.7305159 hartree
pointgroup: C01 [X(C27H51N4Na1O1)]
dipole: -2.6986736 -2.5143627 -0.3244496 debye
polarizability: 409.2862345|-19.242859|340.8035506|-12.0865102|-14.5060033|292.3893177 unknown
InChI: InChI=1S/C18H28NO.C9H23N3.Na/c1-17(2)12-8-13-18(3,4)19(17)21-15-9-14-20-16-10-6-5-7-11-16;1-10(2)6-8-12(5)9-7-11(3)4;/h5-7,9-11,14H,8,12-13,15H2,1-4H3;6-9H2,1-5H3;
charge 0 multiplicity 1
84 atoms
N  -1.87681009 -2.09076184 1.88893693
N  -3.61406192 -0.33724943 -1.2543551
N  -1.71069079 -2.62742698 -1.0929549
C  -0.40904414 -3.0346999 -1.61734593
H  -0.47599574 -3.95338295 -2.22620768
H  0.28652338 -3.21688208 -0.79683606
H  0.01712752 -2.23362598 -2.22740426
C  -1.61709668 -3.40220555 1.29515632
C  -2.20012149 -3.59028395 -0.10324246
H  -1.98563322 -4.62451494 -0.42574639
H  -3.28816409 -3.51548049 -0.04642783
C  -2.66336213 -2.44992892 -2.19102314
H  -2.9867281 -3.42264105 -2.60452081
H  -2.13789948 -1.93675862 -3.00212434
C  -3.30183556 -1.85878815 2.09504964
H  -3.44148376 -0.89340928 2.58787392
H  -3.76945505 -2.64170612 2.71906926
H  -3.82282839 -1.8164642 1.13696562
C  -3.91052459 -1.65277941 -1.80948826
H  -4.55329902 -1.5788269 -2.70692466
H  -4.49404174 -2.20614844 -1.06517276
C  -3.08307147 0.57631511 -2.26216473
H  -2.17108536 0.1736953 -2.71023494
H  -2.80155332 1.50940037 -1.7719465
C  -4.79731011 0.25432931 -0.64263735
H  -5.18538285 -0.39828902 0.14491002
H  -5.60545475 0.42960146 -1.37480281
H  -4.53030285 1.21287021 -0.18995748
Na -1.40937728 -0.36773798 0.04307165
H  -2.01981912 -4.21045688 1.93549285
H  -0.53144259 -3.54396462 1.26643973
H  -3.81114594 0.77315466 -3.06903728
C  -1.17209571 -1.97653385 3.16319028
H  -1.33811655 -0.98295976 3.58619154
H  -1.5166264 -2.72978 3.89374268
H  -0.09741898 -2.10139926 3.01259469
C  -1.40781761 2.72869007 1.09850891
C  0.05651583 2.62056204 -0.92643391
C  -2.06084906 1.752529 2.09418007
C  0.74856423 1.53979801 -1.77061775
H  0.29639938 2.89024074 2.41063387
H  1.85678756 2.79619368 0.25489636
H  -2.47214811 2.28419348 2.95917769
H  1.42900196 1.98703466 -2.50355753
H  -2.89030749 1.22043578 1.60746566
H  -0.00396174 0.96141511 -2.32404166
H  -1.33730726 1.01972581 2.45973945
H  1.32988519 0.85621629 -1.15220105
C  -0.34545254 3.57402245 1.84033944
C  -2.55312229 3.64576222 0.60759857
C  1.13170672 3.47357308 -0.20962166
C  -0.70483724 3.52411806 -1.92590136
C  0.52695417 4.37562653 0.87007486
H  -0.82545224 4.24651912 2.56412447
H  -2.20144685 4.55275832 0.11474973
H  -3.18890019 3.10689957 -0.10313158
H  -3.175149 3.96301813 1.45346773
H  1.68453365 4.07896513 -0.9398441
H  -0.03633154 3.80869074 -2.74692586
H  -1.07301048 4.44985472 -1.48201277
H  -1.55980082 2.99904614 -2.36041878
H  1.32611983 4.88292459 1.42249483
H  -0.06789143 5.17222443 0.40431595
N  -0.78364514 1.90835936 0.05129498
H  0.1135844 1.1239195 0.72758075
C  6.86894515 0.04173199 -0.91206216
C  5.50134563 0.26476339 -0.98722438
C  4.62487943 -0.5653351 -0.28450132
C  5.11988804 -1.61103885 0.49441717
C  6.49547719 -1.82499298 0.55514265
C  7.37600729 -1.00714384 -0.1443231
H  7.54544777 0.6905949 -1.46024352
H  5.08822078 1.07315024 -1.58106961
H  4.43361621 -2.23181671 1.05937582
H  6.87779549 -2.63833998 1.16493484
H  8.44586684 -1.17997357 -0.09064827
O  3.29732468 -0.27662158 -0.39455621
C  2.38318543 -1.24812007 -0.01870099
H  2.53517953 -2.21769775 -0.48806121
C  1.37496455 -0.96294658 0.81876574
H  0.69503295 -1.80168283 0.97959062
C  1.02849874 0.31680286 1.44125792
H  1.90164268 0.97168949 1.51733903
H  0.61644209 0.16442132 2.44568318
