program: Gaussian 16
title: Na-PMDETA-AllyletherE-HAllyletherZ TS opt
version: ES64L-G16RevC.01
frameworkgroup: C1[X(C27H42N3NaO2)]
method: RwB97XD
basis: Gen
operation: Freq
keyword: #P
keyword: Geom=AllCheck
keyword: Guess=TCheck
keyword: SCRF=Check
keyword: GenChk
keyword: RwB97XD/ChkBas
keyword: Freq
converged: YES YES NO YES
title: Mulliken charges:
elementType: Na N N N C C C C C C C C C H H H H H H H H H H H H H H H H H H H H H H H C C C C C C H H H H H O C H C H C H H C C C C C C H H H H H O C H C H C H H H
charge: 0.537740 -0.611481 -0.642179 -0.647982 -0.068724 -0.073803 -0.185930 -0.059130 -0.191285 -0.177610 -0.046360 -0.194565 -0.182922 0.137398 0.141864 0.137297 0.123783 0.135583 0.154363 0.127971 0.135665 0.117362 0.132728 0.158481 0.142030 0.136048 0.134148 0.145730 0.132054 0.138748 0.148240 0.152491 0.132801 0.130410 0.172534 0.103376 -0.132225 -0.160724 0.376980 -0.178818 -0.129004 -0.130837 0.119610 0.112829 0.143819 0.123120 0.116393 -0.570678 0.007690 0.103155 -0.049432 0.117618 -0.495148 0.100521 0.092328 -0.132548 -0.168975 0.368764 -0.145110 -0.136915 -0.134160 0.120986 0.126597 0.141905 0.126107 0.117875 -0.578075 -0.097680 0.182756 -0.079744 0.117707 -0.316128 0.088341 0.099375 0.104850
chargesum: -0.00000
title: Mulliken charges with hydrogens summed into heavy atoms:
elementType: Na N N N C C C C C C C C C C C C C C C O C C C C C C C C C O C C C
charge: 0.537740 -0.611481 -0.642179 -0.647982 0.210537 0.187277 0.231987 0.193897 0.241954 0.238316 0.224442 0.238967 0.223399 -0.012615 -0.047894 0.376980 -0.034999 -0.005885 -0.014444 -0.570678 0.110845 0.068186 -0.302299 -0.011562 -0.042378 0.368764 -0.003205 -0.010808 -0.016286 -0.578075 0.189927 0.037963 -0.128412
polarizability: 3.93444372e+02 1.91548071e+00 3.27017506e+02 -4.26700090e+00 1.90346571e+00 3.09248891e+02
1716.lowfreq: -1322.0299 -9.5996 -5.6409 -0.0012 -0.0009 -0.0007 3.4281 17.9818 26.5064
frequency: -1322.0299 17.9448 26.5028 29.4057 40.9410 46.8434 49.7928 52.9948 55.7441 64.6388 69.6738 76.0866 79.3683 84.2506 97.3929 108.2532 111.0013 120.5662 129.5464 134.4817 138.5358 151.7761 159.9709 165.5511 173.3437 191.9319 221.5509 221.9644 226.8115 242.3397 254.5557 260.7769 268.1082 287.9521 289.8293 294.9452 314.0360 325.9580 333.9009 336.6197 346.9028 375.4140 377.8815 382.2633 390.0762 408.0057 429.4365 431.4304 437.1215 443.2863 452.5593 458.9567 470.3064 484.2472 515.2381 528.1230 541.6615 556.4412 580.9415 599.7543 600.3702 605.1168 631.6368 637.7947 652.5623 672.0047 713.8897 719.2338 738.2885 782.4193 786.1465 789.8971 797.4817 812.4096 824.9318 844.5180 853.0982 856.4213 863.9311 921.5913 924.2630 926.8654 933.9324 948.3868 972.0730 983.0250 985.5608 987.1181 992.3377 993.4907 999.5432 1007.9872 1011.5736 1020.6900 1021.9414 1025.4440 1031.0825 1046.4505 1064.0229 1065.5739 1067.8608 1069.9146 1073.7735 1077.9643 1082.9240 1110.4293 1115.2262 1120.5204 1124.7499 1133.4850 1136.6472 1143.0036 1153.9293 1162.3557 1166.8929 1189.0957 1191.7301 1195.0448 1204.8680 1205.6905 1207.3362 1212.4985 1224.0149 1270.4258 1282.6099 1283.8740 1306.8383 1309.7413 1312.5306 1314.9020 1317.8026 1331.4832 1339.1557 1342.4674 1343.6440 1345.9039 1348.8999 1357.6023 1360.5690 1369.5289 1372.7889 1404.8308 1416.5683 1441.6342 1449.0105 1457.4583 1460.5072 1464.9401 1478.2511 1486.0102 1487.0575 1488.4065 1493.3304 1494.4028 1498.9629 1500.3976 1501.7518 1506.3798 1511.3389 1512.8063 1513.7775 1514.8868 1516.7466 1519.5649 1520.2203 1525.7637 1530.9299 1535.8025 1552.3148 1553.1626 1567.4632 1576.6336 1669.2769 1676.8774 1685.6448 1688.7383 1695.8495 1700.9523 2955.0040 2960.4769 2968.7657 2973.1590 2974.6652 2978.5404 2979.1523 2981.7660 2997.4379 3068.4695 3079.4745 3103.8122 3111.2358 3119.3330 3128.4400 3129.3651 3132.1462 3135.2793 3139.8686 3143.7144 3149.8381 3159.5782 3166.5126 3170.9090 3185.7538 3189.0815 3190.8728 3193.9662 3197.0320 3204.5658 3208.3026 3208.4885 3215.6224 3215.8561 3229.3668 3234.0889 3238.3779 3243.1272 3252.9147 3255.2159 3280.3882
redmass: 1.1118 4.8723 4.0484 4.5782 4.7829 3.9597 4.4468 3.9715 3.9106 4.2104 4.0045 4.7899 4.1661 3.5177 4.7614 3.9529 3.4172 3.2753 3.4036 3.5931 3.0987 4.6820 5.4892 2.9701 6.7497 5.2136 3.6102 2.3864 2.7579 1.4554 1.4092 2.7517 1.5893 2.2661 1.4443 2.6268 2.0659 1.5165 2.1543 1.8289 2.5412 1.8532 4.5179 2.0284 2.5427 3.3898 3.0661 3.0314 1.9872 1.9267 2.6055 2.0536 2.0709 2.1310 3.4786 2.7585 1.5346 2.5380 2.4331 3.5402 5.2348 2.8453 6.2471 5.6343 3.8807 1.4264 2.1140 2.1597 1.6774 1.6421 1.6603 2.1036 1.4882 2.6270 2.9950 3.8052 1.3932 1.9583 1.8598 1.4569 1.9559 1.5335 1.5346 1.9705 2.2678 1.7755 1.6797 1.3809 1.3630 1.4581 1.5217 1.2655 1.2649 5.2141 4.5684 2.1303 1.7904 1.3787 1.9881 2.0320 2.2540 2.0131 1.7815 1.4795 1.4763 1.9539 1.4685 1.5373 1.8912 1.2899 1.3762 2.6059 1.9471 1.5613 1.6253 1.1203 1.1223 1.4523 1.1431 1.2347 1.5150 1.9979 1.8897 2.8723 2.3310 2.4110 2.0151 1.7603 3.1449 1.3455 2.2559 1.4205 1.8872 1.3794 1.3471 1.7213 1.4217 1.3477 1.4547 2.7373 2.9012 1.3878 1.3425 1.4521 1.3942 1.1655 1.2488 1.1780 1.1653 1.1686 1.1217 1.1530 1.0619 1.0632 1.0871 1.1017 1.1051 1.1068 1.7359 1.2121 1.4083 1.4759 1.1204 1.0900 1.0645 1.0702 1.0854 1.0712 1.9283 2.3943 1.2425 1.1000 6.0670 6.2102 5.2599 5.6046 5.2251 5.1838 1.0720 1.0717 1.0592 1.0710 1.0590 1.0594 1.0587 1.0612 1.0747 1.0848 1.0603 1.0876 1.0885 1.0891 1.0796 1.0806 1.0790 1.0760 1.0760 1.0900 1.0846 1.0846 1.1021 1.0886 1.1028 1.0871 1.0903 1.0841 1.0999 1.0985 1.0857 1.0852 1.0907 1.0899 1.0932 1.0947 1.0981 1.0953 1.0934 1.0939 1.1139
irintensity: 7405.3414 0.3323 0.0270 0.6109 0.7030 0.2575 1.4972 1.2874 0.8029 0.0099 0.6576 0.7047 1.7540 0.2492 0.9472 1.9207 1.1409 0.6843 0.9501 1.6397 1.8972 16.6753 7.9502 2.5690 19.8814 25.4924 2.2906 0.8588 0.9192 0.4508 1.7590 6.5260 1.5877 0.4704 3.5070 6.5171 1.0244 1.7532 2.6476 1.6105 5.5533 1.9669 4.5820 2.3672 2.6655 1.4579 0.3641 1.2310 7.5719 5.6279 8.2197 1.2812 0.3706 3.5931 7.9851 5.7839 16.2969 25.3916 7.8280 10.2631 1.9013 5.2539 3.3908 0.7674 6.5465 47.2490 19.9073 25.5454 54.7386 49.8937 65.1658 17.5082 71.8970 14.9172 22.6652 11.3045 2.8129 9.3579 10.0088 9.7876 5.6202 24.3374 79.7798 106.7216 16.5607 28.8898 10.4325 0.3641 0.8213 40.0024 14.1848 0.8581 1.2001 0.1188 4.1647 18.9470 9.7662 30.5857 5.2410 5.4626 2.9960 17.6879 18.5357 16.4461 4.4563 27.7230 4.1143 5.3764 5.1986 2.1221 8.7489 67.3526 30.2483 18.0929 20.1692 1.5260 2.2704 24.9815 7.6294 12.7260 25.5027 36.4004 11.4710 1.9809 51.7579 174.8583 9.7057 108.7702 191.5717 9.6808 9.3753 2.1087 18.4137 7.6484 6.0369 1.6011 18.0010 1.0475 21.1266 19.2302 19.0772 14.9238 19.0715 6.1173 2.7275 1.3070 1.2363 1.2321 2.7147 5.9846 0.6321 3.8410 6.1215 6.9639 3.0238 11.9101 13.1045 10.7236 0.9555 21.4789 9.1544 21.6078 5.1647 18.9539 8.1358 12.0979 23.6258 35.8708 163.5772 163.7674 17.7638 5.5864 32.7058 6.7860 55.9375 118.9310 78.6000 89.2255 35.7815 3.2729 45.2271 33.6870 38.1534 111.9059 125.0728 158.4977 114.8559 34.3594 27.9503 0.1214 2.6606 30.7845 9.9321 20.2488 31.9154 11.1131 14.7998 12.0362 31.9477 18.8765 36.9795 40.7001 14.4026 8.8325 8.6654 14.5471 5.7917 2.6723 1.2486 4.9413 15.4775 9.8393 29.5853 25.1041 20.7256 6.7752 0.8742 15.3397 19.4408
temp: 298.150 k
press: 1.00000 atm
elementType: 11 7 7 7 6 6 6 6 6 6 6 6 6 1 1 1 1 1 1 1 1 1 1 1 1 1 1 1 1 1 1 1 1 1 1 1 6 6 6 6 6 6 1 1 1 1 1 8 6 1 6 1 6 1 1 6 6 6 6 6 6 1 1 1 1 1 8 6 1 6 1 6 1 1 1
symmnumber: 1
zpe: 1709705.1 jmol-1
zpe.correction: 0.651192 hartree
zpe.thermalcorrener: 0.687817 hartree
zpe.thermalcorrenthalpy: 0.688761 hartree
zpe.thermalcorrgfe: 0.581629 hartree
zpe.sumelectzpe: -1530.032334 hartree
zpe.sumelectthermal: -1529.995710 hartree
zpe.sumelectthermalent: -1529.994765 hartree
zpe.sumelectthermalfe: -1530.101898 hartree
dipole: -0.5671 4.9507 -3.7311
dipole: 6.2251
quadrupole: -203.2700 -194.2941 -200.7155
quadrupole: -2.1921 -11.2076 0.4104
quadrupole: -3.8435 5.1324 -1.2890 -2.1921 -11.2076 0.4104
hfenergy: -1530.6835265 hartree
pointgroup: C01 [X(C27H42N3Na1O2)]
dipole: -0.2287533 1.9349852 -1.4838589 debye
polarizability: 393.4286622|2.0363385|327.0569867|-4.3508765|1.7443359|309.2251198 unknown
InChI: InChI=1S/C18H19O2.C9H23N3.Na/c1-2-18(20-17-12-7-4-8-13-17)21-15-9-14-19-16-10-5-3-6-11-16;1-10(2)6-8-12(5)9-7-11(3)4;/h2-14,18H,1,15H2;6-9H2,1-5H3;
charge 0 multiplicity 1
75 atoms
Na 0.45971763 0.52820992 0.48134495
N  1.5008176 2.63544991 -0.60976329
N  -1.30106126 2.44233158 0.66837483
N  0.57555094 0.08778544 -2.00743562
C  0.6880505 3.75954739 -0.14186417
C  1.41094588 2.43980456 -2.061748
C  2.89741754 2.84200427 -0.23513797
C  -0.8183115 3.51756407 -0.19914781
C  -1.33380463 2.86956774 2.06510198
C  -2.6486653 2.05094192 0.25938095
C  1.6231411 0.98903786 -2.48378964
C  0.94317515 -1.30238943 -2.27139017
C  -0.70834312 0.36501098 -2.64189161
H  0.90809526 4.67844225 -0.71675157
H  0.98441109 3.96716298 0.89151366
H  2.15246967 3.06956425 -2.58266122
H  0.43519084 2.77914944 -2.41434226
H  3.3019039 3.77802387 -0.66000775
H  3.00763086 2.87465319 0.85023843
H  3.50181552 2.01080346 -0.59828167
H  -1.32501344 4.4710477 0.04102615
H  -1.11335744 3.27303226 -1.22421791
H  -2.05769676 3.68915897 2.22371786
H  -1.61320429 2.02494812 2.69997165
H  -0.34837251 3.20271179 2.38944425
H  -3.34539711 2.90790966 0.26707183
H  -2.6321313 1.61469665 -0.74093326
H  -3.03950051 1.29235118 0.94004698
H  1.6989189 0.95591242 -3.58773522
H  2.57691889 0.62419396 -2.08862972
H  1.91548633 -1.52574575 -1.83229048
H  0.19896732 -1.96284809 -1.81898496
H  0.99033592 -1.51501235 -3.35430262
H  -0.64296768 0.30712364 -3.7439249
H  -1.43713024 -0.36131799 -2.28260779
H  -1.07429664 1.35773288 -2.37080687
C  -5.7141594 -0.73654487 -1.53036556
C  -4.33044288 -0.67758728 -1.43625295
C  -3.68724809 -1.17111631 -0.29711981
C  -4.43589982 -1.72204074 0.74315032
C  -5.8241264 -1.7708408 0.63450049
C  -6.47208499 -1.27971506 -0.49369371
H  -6.20432008 -0.3519708 -2.41971338
H  -3.73436889 -0.25317149 -2.23769387
H  -3.93144437 -2.12237542 1.61460022
H  -6.40106388 -2.20451334 1.44583716
H  -7.55360637 -1.32144154 -0.56816822
O  -2.32544733 -1.07307878 -0.2729261
C  -1.68598395 -1.27950143 0.95800675
H  -2.00882638 -0.60848439 1.75368702
C  -0.84260317 -2.3207091 1.1404786
H  -0.68175485 -2.94687316 0.2599632
C  -0.07119244 -2.61522953 2.32223409
H  -0.54203645 -2.28457305 3.25455766
H  0.23190706 -3.66171223 2.39204444
C  4.79063237 -1.61818362 -1.39005365
C  4.23885484 -0.77314136 -0.43391982
C  3.26905386 -1.25085612 0.45396885
C  2.89806014 -2.59901649 0.41098034
C  3.46950812 -3.43581797 -0.54401275
C  4.4049816 -2.95552069 -1.45668934
H  5.53818283 -1.2310345 -2.07603542
H  4.56620858 0.25666066 -0.34331951
H  2.14928803 -2.97663498 1.09696215
H  3.16780584 -4.47851075 -0.57596914
H  4.83820524 -3.61633852 -2.19998631
O  2.71992092 -0.34916597 1.30774476
C  2.16166123 -0.88288232 2.53807749
H  1.07105992 -1.76789695 2.3513111
C  1.71279994 0.19466331 3.39486498
H  1.37338459 -0.16154981 4.3686071
C  1.58153231 1.50764699 3.12110667
H  1.94527039 1.92999494 2.19049507
H  1.16556013 2.19217714 3.85183268
H  2.9126377 -1.51876536 3.02439333
