program: Gaussian 16
title: Na-PMDETA-HTMP-allyletherE TS displacement f
version: ES64L-G16RevC.01
frameworkgroup: C1[X(C27H51N4NaO)]
method: RwB97XD
basis: Gen
operation: Freq
keyword: #P
keyword: Geom=AllCheck
keyword: Guess=TCheck
keyword: SCRF=Check
keyword: GenChk
keyword: RwB97XD/ChkBas
keyword: Freq
converged: YES YES NO YES
title: Mulliken charges:
elementType: N N N C H H H C C H H C H H C H H H C H H C H H C H H H Na H H H C H H H C C C C H H H H H H H H C C C C C H H H H H H H H H H N H C C C C C C H H H H H O C H C H C H H
charge: -0.651328 -0.613332 -0.649871 -0.186980 0.133214 0.150695 0.150698 -0.061179 -0.061033 0.134837 0.120323 -0.079513 0.137614 0.151494 -0.187232 0.150230 0.137087 0.123058 -0.057088 0.138723 0.113731 -0.205266 0.129279 0.182150 -0.195880 0.124515 0.140555 0.152298 0.515123 0.130968 0.144374 0.132854 -0.200023 0.149819 0.137269 0.163454 0.137581 0.136192 -0.365736 -0.353253 0.135282 0.126794 0.118398 0.116581 0.106283 0.109650 0.146739 0.145273 -0.207641 -0.336092 -0.204082 -0.336515 -0.227202 0.097314 0.114234 0.118346 0.107307 0.100323 0.109520 0.109607 0.124685 0.115665 0.100722 -0.698170 0.314629 -0.127876 -0.159597 0.377138 -0.155594 -0.137216 -0.139651 0.118958 0.134749 0.117868 0.117488 0.111767 -0.617454 0.013309 0.097104 -0.049546 0.075756 -0.472177 0.074353 0.062548
chargesum: -0.00000
title: Mulliken charges with hydrogens summed into heavy atoms:
elementType: N N N C C C C C C C C Na C C C C C C C C C C N C C C C C C O C C C
charge: -0.651328 -0.613332 -0.649871 0.247627 0.214163 0.194127 0.209596 0.223143 0.195366 0.239016 0.221488 0.515123 0.250519 0.137581 0.136192 0.005684 0.018251 0.024955 0.003794 0.023035 0.007298 -0.010815 -0.383541 -0.008917 -0.024847 0.377138 -0.037726 -0.019728 -0.027884 -0.617454 0.110413 0.026210 -0.335276
polarizability: 3.90317942e+02 1.78618857e+01 3.10007713e+02 6.67058497e+00 7.01712441e+00 3.11373230e+02
1716.lowfreq: -4.5829 -1.7171 -0.0010 -0.0004 0.0005 4.5833 25.6213 32.4270 41.6451
frequency: 25.5740 32.4114 41.6365 44.6439 54.0004 54.9473 60.9936 65.8130 68.1367 73.4926 78.4686 84.0542 91.3990 99.1179 101.6181 113.5129 129.5602 137.8052 144.9316 150.7228 156.1498 158.6796 165.1012 177.3182 189.1349 218.6330 228.9891 239.0369 252.5305 259.0570 265.7034 273.5889 278.6037 280.7689 284.1833 298.5337 298.9998 302.6301 304.3761 310.5628 316.5005 331.0474 332.7354 335.0586 356.3230 367.4146 376.3508 385.1242 391.1436 398.8679 414.6229 419.0916 430.1049 433.7344 434.8406 456.0121 469.3063 478.9482 480.4930 492.1520 499.7439 526.0120 545.5539 566.3230 584.2298 588.5439 594.5739 607.1886 618.1803 636.8765 694.6969 717.5274 725.3040 780.2584 783.7597 784.4184 791.6513 812.6143 826.9676 840.0324 859.6172 867.8651 881.7811 913.6109 919.5224 929.3026 936.8850 954.9353 957.2120 961.8629 972.6785 972.9552 982.7942 987.9499 990.4272 1003.0117 1015.1991 1016.2506 1019.1512 1022.8017 1024.3265 1050.6336 1064.5530 1068.9745 1073.3729 1077.9452 1078.4248 1080.2439 1086.1385 1090.8503 1112.3313 1113.0957 1114.6404 1119.4455 1124.5201 1133.2688 1135.4624 1139.6450 1163.8297 1169.1560 1175.6944 1188.2701 1196.5055 1199.9646 1207.9776 1209.5301 1230.0444 1238.6396 1240.6639 1263.0214 1273.1163 1275.8095 1279.8354 1282.8155 1284.6040 1304.2332 1305.4666 1310.2987 1316.3230 1334.0262 1338.4934 1339.0105 1344.5536 1347.9788 1362.5309 1367.6404 1375.3766 1380.8262 1397.7835 1401.1447 1406.2536 1409.4970 1417.7580 1418.9594 1428.3841 1436.5264 1443.8839 1450.9404 1456.1888 1461.3809 1476.2814 1478.7447 1485.6745 1486.5970 1488.5765 1493.6217 1495.8905 1496.9567 1498.1381 1499.4797 1502.6434 1504.9226 1505.3453 1508.7168 1509.0896 1510.7970 1511.0780 1512.8983 1513.8012 1517.1715 1518.7326 1520.0325 1521.2717 1524.4224 1529.4175 1530.6128 1532.4587 1533.5452 1540.8872 1542.7802 1551.6165 1618.4391 1668.1306 1675.5779 1691.6024 2960.3106 2960.6277 2972.0522 2972.6388 2974.4572 2978.3102 2979.9685 2980.9155 2988.6931 3044.7985 3050.0935 3052.1969 3063.1075 3063.7988 3067.9223 3072.7610 3073.6112 3089.4153 3091.0018 3097.1757 3101.7643 3102.0827 3108.1814 3113.8364 3116.6619 3118.5430 3120.0809 3125.1982 3133.2449 3136.4514 3139.6301 3140.4667 3145.0263 3146.7493 3149.3531 3158.2171 3160.2551 3165.7348 3166.0727 3167.9619 3168.6783 3173.7703 3182.0448 3194.9710 3208.8025 3209.3704 3214.4344 3229.3539 3237.9368 3262.0140 3294.2554
redmass: 4.3445 5.1539 4.2344 3.7742 4.4766 3.7734 3.6417 4.0725 3.7227 3.7881 3.8855 4.4730 3.6240 3.3807 4.4481 3.1882 3.4214 3.6362 3.0519 2.9933 2.5998 2.8624 1.4949 2.8043 3.0661 2.5035 2.7051 1.3362 2.4036 1.5766 1.3932 1.4377 1.4603 1.6214 1.3237 1.5965 1.3625 1.4171 1.8161 2.7113 1.6721 2.3300 1.9653 1.6942 3.6321 2.2889 2.4876 2.1077 4.3943 2.3315 1.8531 2.4104 1.8839 2.7127 2.2067 1.9697 2.0434 2.1700 2.1374 2.9516 3.0957 2.4711 1.5052 2.4093 2.4784 5.0932 2.1777 2.8862 2.9039 5.5275 1.8198 2.1766 2.7292 1.5490 1.7282 2.5348 2.3279 2.6301 3.0221 5.7163 1.2510 2.0706 1.4723 2.9236 1.5045 1.9189 1.9758 1.3954 1.4826 1.4544 1.6466 2.2149 2.1870 1.5979 1.3377 1.2725 1.3967 1.3969 3.9976 1.5426 2.1050 1.8946 1.9924 2.0515 1.7666 1.9063 1.5560 1.4963 1.6506 1.5271 1.5831 1.5975 1.5035 1.4509 1.7379 2.5226 1.3913 1.3072 1.4073 1.8201 1.7562 1.1115 1.4200 1.2100 2.1095 1.6880 1.8600 2.2450 2.5141 1.6144 2.5556 2.9126 1.7341 2.2806 2.2268 1.4422 2.1365 1.9765 1.8825 1.5811 1.5534 1.6040 1.5578 1.5519 1.4171 1.6058 3.2059 1.4620 1.5917 1.4465 1.3538 1.3381 1.3521 1.3470 1.2743 1.2682 1.4676 1.3971 1.1660 1.1872 1.1762 1.1765 1.0689 1.1169 1.1491 1.0711 1.0897 1.0820 1.0821 1.0634 1.0631 1.0756 1.0657 1.0735 1.2474 1.5908 1.0817 1.1103 1.0949 1.0737 1.0824 1.0755 1.0780 1.0678 1.0727 1.0652 1.0691 1.0822 1.0626 1.0570 2.4032 1.1721 6.2680 5.1126 5.8203 1.0716 1.0713 1.0577 1.0700 1.0569 1.0572 1.0603 1.0585 1.0734 1.0584 1.0373 1.0599 1.0418 1.0584 1.0391 1.0801 1.0454 1.0585 1.0883 1.1018 1.0995 1.0812 1.0884 1.1038 1.0878 1.0784 1.0773 1.0794 1.0806 1.1016 1.1028 1.1025 1.1014 1.0874 1.0998 1.1049 1.1031 1.1012 1.1028 1.1024 1.1011 1.1032 1.0975 1.0876 1.0982 1.0888 1.0898 1.0940 1.0969 1.0905 1.0779
irintensity: 0.7868 1.4119 0.3428 0.1159 1.3665 2.0902 0.5992 2.8221 1.1932 0.2325 0.5090 1.2351 0.2355 0.6459 1.2985 1.7334 0.3167 1.2699 10.4243 1.2067 7.3307 0.7412 5.5175 7.1354 13.9462 4.8754 0.9215 0.3581 8.4679 3.8321 1.9729 2.7731 4.3775 2.8900 0.3030 1.1065 0.0485 0.1556 0.2413 2.3565 0.0483 0.5725 0.1646 1.8761 12.7288 3.5029 1.2574 3.1463 1.9787 2.2516 0.9478 0.5631 7.6273 1.9638 6.0252 1.0535 0.5463 1.7183 1.6658 1.5860 0.1079 15.8312 17.0215 8.0681 4.1050 0.9594 0.6776 40.9228 6.7366 12.4086 27.7256 14.9399 2.2032 337.4515 44.9368 37.0988 8.1502 21.3463 23.8530 4.4895 0.2562 12.0746 1.0496 9.2650 12.6036 7.3661 0.4320 7.5126 5.6919 0.4198 12.8383 23.8887 6.5594 3.0503 1.4438 0.8166 27.7041 0.6188 1.4531 38.2593 13.5592 4.0964 4.7071 12.4076 13.8092 0.6506 8.9502 5.7498 2.5878 8.5492 67.4940 3.1388 29.0144 7.6370 2.0670 146.1062 15.3762 2.1194 5.3241 33.9291 16.0961 3.1925 9.4843 13.9679 95.3326 36.1538 9.3076 0.5574 0.2502 1.7187 41.1982 2.0266 1.4952 111.2951 69.7798 10.9902 56.8211 1.2855 6.6553 6.9469 3.7021 14.0891 6.1275 22.2509 23.9046 2.6455 29.9590 0.0373 6.7046 0.0681 3.8073 13.1673 26.8288 15.8290 26.9901 10.9037 5.8275 3.8963 0.1358 2.0868 0.3944 12.5136 0.4787 0.5426 1.7024 3.3026 5.2965 1.5829 2.2316 0.6177 6.9147 1.3956 1.5440 3.4457 5.5030 1.7815 20.2866 15.9996 2.2078 17.8830 25.3416 8.4451 1.1569 3.1979 18.8876 2.9608 23.3260 22.7170 23.8478 6.9864 109.7114 3.4825 9.8316 67.3282 129.0444 26.2797 9.0906 22.2416 42.2465 31.2786 148.1841 121.7669 73.3945 177.2407 14.9895 39.1745 17.1393 6.7039 28.1842 31.7802 63.3957 25.8700 32.6917 13.3102 46.1430 38.6335 33.9330 6.4589 45.8734 12.8926 13.8182 37.8772 7.8290 13.4142 25.2070 11.2024 11.9259 51.5994 31.0097 43.7897 67.8069 5.7729 14.5341 14.1724 8.7516 15.8327 4.7838 45.4828 7.7749 3.4897 17.1739 48.5750 20.6734 12.5820 0.4612 394.9411
temp: 298.150 k
press: 1.00000 atm
elementType: 7 7 7 6 1 1 1 6 6 1 1 6 1 1 6 1 1 1 6 1 1 6 1 1 6 1 1 1 11 1 1 1 6 1 1 1 6 6 6 6 1 1 1 1 1 1 1 1 6 6 6 6 6 1 1 1 1 1 1 1 1 1 1 7 1 6 6 6 6 6 6 1 1 1 1 1 8 6 1 6 1 6 1 1
symmnumber: 1
zpe: 2001527.8 jmol-1
zpe.correction: 0.762342 hartree
zpe.thermalcorrener: 0.801225 hartree
zpe.thermalcorrenthalpy: 0.802169 hartree
zpe.thermalcorrgfe: 0.693080 hartree
zpe.sumelectzpe: -1514.992041 hartree
zpe.sumelectthermal: -1514.953158 hartree
zpe.sumelectthermalent: -1514.952214 hartree
zpe.sumelectthermalfe: -1515.061303 hartree
dipole: 0.2401 6.5167 -5.1183
dipole: 8.2899
quadrupole: -203.7739 -201.1497 -216.2032
quadrupole: -9.5346 6.0816 8.0836
quadrupole: 3.2684 5.8926 -9.1609 -9.5346 6.0816 8.0836
hfenergy: -1515.7543826 hartree
pointgroup: C01[X(C27H51N4Na1O1)]
dipole: -1.0408678 2.7707429 1.3699739 debye
polarizability: 390.2483565|9.9883451|305.3084862|16.8769173|-2.2018863|316.1420422 unknown
InChI: InChI=1S/C9H23N3.C9H19N.C9H9O.Na/c1-10(2)6-8-12(5)9-7-11(3)4;1-8(2)6-5-7-9(3,4)10-8;1-2-8-10-9-6-4-3-5-7-9;/h6-9H2,1-5H3;10H,5-7H2,1-4H3;2-8H,1H2;
charge 0 multiplicity 1
84 atoms
N  -0.53014332 2.76741681 -1.91965305
N  -0.5334452 1.58645146 1.90954098
N  1.73044178 2.40301942 0.12844791
C  3.03143189 1.93647203 -0.3475039
H  3.82625879 2.68131988 -0.165525
H  2.9966165 1.72397928 -1.41863591
H  3.29901527 1.01042436 0.15875494
C  0.76850024 3.44158136 -1.9273487
C  1.36362353 3.65277156 -0.54007046
H  2.24374444 4.31311198 -0.63630088
H  0.64635698 4.19717231 0.07796684
C  1.75668336 2.54886553 1.58460022
H  2.36318717 3.42058937 1.8927442
H  2.26105795 1.66718113 1.99249156
C  -1.57191326 3.60106345 -1.3315817
H  -2.53564237 3.09561018 -1.4251143
H  -1.64738585 4.58768302 -1.82349753
H  -1.38561542 3.75861644 -0.26572367
C  0.37309924 2.68923253 2.21442325
H  0.50753521 2.80181885 3.30692516
H  -0.10514667 3.6133351 1.87093621
C  -0.11535537 0.34105859 2.5482017
H  0.8573357 0.02098883 2.16493602
H  -0.84777821 -0.43081537 2.30162123
C  -1.89387712 1.91163902 2.31769238
H  -2.24766046 2.7967051 1.77914748
H  -1.9709564 2.1108611 3.4015468
H  -2.54612588 1.07162872 2.07021202
Na -0.19682785 0.76730738 -0.43436996
H  0.69603523 4.42494452 -2.42966503
H  1.45258492 2.83219108 -2.52684749
H  -0.04086093 0.44101557 3.64595292
C  -0.89745829 2.3905067 -3.28152694
H  -1.84485323 1.84649669 -3.27180566
H  -1.00365416 3.27022407 -3.94096325
H  -0.13607904 1.72734484 -3.6990859
C  -3.6180293 -0.90905728 -0.25275056
C  -2.1463378 -2.73926743 0.72578148
C  -3.37258237 0.44615963 -0.92748309
C  -0.6381097 -2.98594825 0.8619212
H  -3.49295297 -1.83969552 -2.19160907
H  -2.03706076 -3.72109327 -1.18930712
H  -4.28705152 0.81496114 -1.40399429
H  -0.44219261 -4.04731948 1.04452385
H  -3.05104653 1.1861878 -0.18585977
H  -0.2217517 -2.42172017 1.70224589
H  -2.5935147 0.35065194 -1.69207715
H  -0.10628628 -2.69250301 -0.04837327
C  -4.13869872 -1.90993002 -1.30586229
C  -4.6634217 -0.7025943 0.85446653
C  -2.71070209 -3.72408913 -0.32220258
C  -2.78640199 -2.97785793 2.10170691
C  -4.11532852 -3.35082389 -0.79515896
H  -5.1510147 -1.62650842 -1.61978651
H  -5.07424062 -1.63836713 1.23609648
H  -4.22959331 -0.16075838 1.69926486
H  -5.5029908 -0.1179576 0.46400097
H  -2.69872889 -4.74169815 0.08679744
H  -2.4171909 -3.91885431 2.52245663
H  -3.87502296 -3.04637301 2.06453499
H  -2.52184846 -2.16655044 2.78698244
H  -4.4323846 -4.03274871 -1.5911898
H  -4.8389287 -3.47864967 0.0197174
N  -2.30456347 -1.33286511 0.28491403
H  -1.64950084 -1.22762429 -0.5044357
C  5.56762226 -0.68952418 1.19409907
C  5.08736173 -1.04044209 -0.0595564
C  3.74996894 -1.42547237 -0.21804586
C  2.91336271 -1.48510478 0.90146468
C  3.41516305 -1.14055686 2.15626143
C  4.73486027 -0.72899426 2.31398861
H  6.60321001 -0.37962677 1.29925936
H  5.72219201 -1.00562105 -0.93863625
H  1.8823909 -1.79228074 0.77514117
H  2.76023487 -1.20142848 3.02208837
H  5.11527016 -0.45834888 3.29337189
O  3.34225221 -1.68693674 -1.48154117
C  1.97837096 -1.97514812 -1.69157749
H  1.71000097 -3.01152905 -1.51110801
C  1.13818007 -1.00840074 -2.12910589
H  1.63510127 -0.04870255 -2.32684056
C  -0.29095682 -1.02882153 -2.27374193
H  -0.73522139 -2.0281167 -2.31763147
H  -0.67237683 -0.39596666 -3.07856899
