program: Gaussian 16
title: Na-PMDETA-HTMP-AllylsilaneZ TS opt CH dist 1.422A
version: ES64L-G16RevC.01
frameworkgroup: C1[X(C24H55N4NaSi)]
method: RwB97XD
basis: Gen
operation: Freq
keyword: #P
keyword: Geom=AllCheck
keyword: Guess=TCheck
keyword: SCRF=Check
keyword: GenChk
keyword: RwB97XD/ChkBas
keyword: Freq
converged: YES YES YES YES
title: Mulliken charges:
elementType: N N N C H H H C C H H C H H C H H H C H H C H H C H H H Na H H H C H H H C C C C H H H H H H H H C C C C C H H H H H H H H H H N C H H C H C H H Si C H H H C H H H C H H H
charge: -0.624184 -0.585735 -0.621098 -0.208948 0.139893 0.157227 0.154244 -0.051702 -0.075068 0.138285 0.123329 -0.065914 0.137635 0.130378 -0.193946 0.146072 0.139101 0.112491 -0.054482 0.135632 0.110247 -0.201909 0.134388 0.148193 -0.201965 0.131786 0.138861 0.155132 0.592476 0.130990 0.140637 0.133289 -0.193638 0.142079 0.133118 0.155035 0.189813 0.198421 -0.347525 -0.349449 0.115816 0.113401 0.110616 0.105068 0.095241 0.097961 0.134221 0.128475 -0.193859 -0.335586 -0.196405 -0.339066 -0.225296 0.083775 0.100684 0.106428 0.098982 0.084527 0.094522 0.103022 0.097513 0.104050 0.092087 -0.809683 -0.381684 0.072327 0.293309 -0.045844 0.069581 -0.458160 0.082827 0.099026 0.755592 -0.575005 0.138260 0.118931 0.124577 -0.585392 0.126083 0.116913 0.124272 -0.591754 0.116209 0.124822 0.135422
chargesum: -0.00000
title: Mulliken charges with hydrogens summed into heavy atoms:
elementType: N N N C C C C C C C C Na C C C C C C C C C C N C C C Si C C C
charge: -0.624184 -0.585735 -0.621098 0.242417 0.219926 0.186546 0.202099 0.203719 0.191397 0.213961 0.223814 0.592476 0.236594 0.189813 0.198421 -0.007447 -0.017945 0.005732 -0.029492 0.001524 -0.044008 -0.029159 -0.809683 -0.309357 0.023737 0.017001 0.755592 -0.193236 -0.218124 -0.215301
polarizability: 3.66680085e+02 -2.06449000e+01 3.39961356e+02 4.04275493e+00 1.77871001e+00 2.92414225e+02
1716.lowfreq: -1365.5168 -3.7742 -2.4192 -1.1227 -0.0014 -0.0011 0.0010 24.9719 34.7302
frequency: -1365.5168 24.9366 34.7201 37.4047 48.0859 54.3815 61.4048 70.1374 76.6780 84.1919 87.6670 90.4405 101.4744 104.4639 107.9389 114.9545 124.1477 139.8321 142.4406 149.1970 152.0301 152.5937 161.8821 165.9585 184.0560 191.3553 200.6643 208.7247 209.4125 216.8982 220.5543 229.1420 235.5952 243.6948 252.5101 253.4516 262.6463 268.8195 280.5112 285.7556 289.7916 294.3846 301.7329 304.9013 306.3233 313.9695 325.9090 335.9134 347.0937 365.6730 377.3846 383.7717 401.8571 405.0508 411.7377 417.1851 427.3294 428.6636 444.5290 456.8040 463.7281 470.4143 487.0913 502.4892 505.4334 522.3763 579.3486 597.4677 600.2248 613.3761 638.6667 659.5171 689.6850 694.3136 701.2359 704.6355 728.4788 736.4792 779.2507 785.6926 791.2388 800.2083 809.1560 825.7074 867.5349 872.8223 875.5635 876.7664 897.0554 912.3742 923.2348 929.0444 939.0802 945.8517 960.7849 972.0337 977.9051 981.1476 984.4364 1002.3628 1010.0979 1015.9061 1025.4222 1049.6003 1057.9461 1062.9145 1069.2692 1071.8560 1076.7061 1079.0368 1082.6231 1083.8257 1107.6967 1109.4149 1124.9196 1126.5459 1133.3236 1136.4078 1165.4105 1169.9725 1176.0671 1194.7701 1205.6833 1221.7877 1228.4824 1231.0866 1247.6237 1262.1120 1266.9825 1272.1485 1276.3261 1286.7515 1297.1636 1306.4307 1308.8609 1311.7959 1312.4659 1319.3633 1332.5635 1333.1858 1345.6867 1355.1239 1362.4181 1377.5078 1387.9014 1393.6898 1395.5287 1398.4010 1404.3240 1405.6472 1412.0232 1417.0611 1420.9853 1443.4965 1450.4199 1458.3896 1461.4278 1469.1692 1471.4681 1473.9144 1474.6971 1476.2285 1483.6777 1484.1039 1486.3438 1486.9408 1488.5533 1491.5702 1492.3728 1495.2451 1496.4898 1497.7941 1499.2390 1501.0181 1502.8763 1505.7493 1508.8022 1509.7041 1510.8454 1512.3483 1515.0610 1516.2093 1516.7774 1517.4350 1519.5327 1523.0240 1524.2647 1527.2887 1528.3052 1529.9492 1531.5970 1544.7820 1565.6306 1639.1737 1703.7337 2958.8588 2971.3043 2971.4411 2973.7821 2977.8528 2980.3060 2981.2860 2987.9177 2995.1834 3040.0200 3045.5760 3047.9722 3051.6632 3052.5203 3054.1421 3056.1755 3056.8690 3058.7115 3060.2208 3062.1379 3077.6470 3090.7707 3103.5808 3108.0114 3109.3345 3110.2773 3111.9365 3113.0026 3113.7412 3119.9359 3120.1763 3121.8062 3126.1414 3128.0706 3129.7345 3132.7549 3135.8739 3140.8186 3141.6364 3142.2461 3144.2716 3145.2991 3146.9748 3150.7947 3159.1439 3159.4772 3162.3980 3165.2431 3166.3418 3168.9958 3169.7903 3182.6877 3186.9066 3190.9401
redmass: 1.0775 3.2676 3.5416 3.7284 3.5242 3.6279 3.7672 3.5995 3.6284 3.7760 3.7291 3.2840 3.7320 3.5297 3.2897 2.9248 3.9249 3.4236 4.0625 1.6867 1.8736 2.5592 2.5397 1.1233 2.5961 2.1015 2.3422 1.2430 1.4493 2.6576 1.8379 6.4705 2.4531 2.2104 1.6483 1.4978 1.5306 1.2348 1.4337 1.3020 1.4416 1.8962 1.1755 1.7872 1.9045 1.2793 1.8491 1.4591 2.1139 2.1745 2.4311 2.3371 2.1154 2.4016 2.4683 2.2148 1.9911 1.9752 1.8628 1.9617 2.0738 2.1520 2.1878 2.9392 2.7295 2.4218 2.4605 2.7860 2.4076 2.6369 2.6797 1.4514 1.2466 2.1728 2.0009 2.3838 1.5406 2.3869 2.8074 1.4826 2.4495 1.6847 2.6615 3.0412 2.0715 1.6344 1.6000 1.5376 1.7617 2.9105 1.9987 1.9688 1.4827 1.5185 1.6762 2.2389 1.4047 1.5334 2.1337 1.3919 1.4291 1.4114 2.1153 1.7066 1.9633 1.9679 1.8060 2.0652 1.5394 1.5865 1.6789 1.5568 1.9958 1.4184 1.5826 1.2995 1.2910 1.3831 1.4755 1.7431 1.8707 1.4796 1.5707 1.8765 2.3233 2.3357 3.2075 1.7033 2.4376 2.3757 1.4868 2.2193 2.2789 1.2722 1.3564 1.9030 1.9628 1.3080 1.3939 1.4752 1.3920 1.4908 1.3947 1.4419 1.5254 1.2990 1.4789 1.4521 1.3995 1.4118 1.2527 1.3231 1.2437 1.4637 1.3313 1.1970 1.1834 1.0697 1.0634 1.0916 1.1071 1.1414 1.0690 1.1224 1.0783 1.0836 1.0817 1.0898 1.0726 1.0566 1.0700 1.0726 1.0648 1.0937 1.0772 1.0698 1.0567 1.0758 1.1053 1.0592 1.0579 1.0955 1.0743 1.0659 1.0539 1.0603 1.0613 1.0686 1.0753 1.0703 1.0545 1.0569 1.1027 4.2925 1.0805 1.0726 1.0624 1.0656 1.0567 1.0591 1.0575 1.0573 1.0725 1.0742 1.0410 1.0607 1.0532 1.0528 1.0360 1.0428 1.0541 1.0353 1.0809 1.0371 1.0491 1.0585 1.0993 1.1020 1.0872 1.0795 1.0815 1.0974 1.0811 1.1002 1.0921 1.0954 1.0865 1.0838 1.0981 1.0874 1.0771 1.1003 1.0941 1.0903 1.1012 1.1021 1.1014 1.1004 1.1008 1.1003 1.1004 1.1015 1.0987 1.0996 1.1011 1.0984 1.0957 1.1042 1.0991
irintensity: 7109.9624 0.4075 0.3056 0.9075 1.0211 0.2396 0.4943 2.0751 0.2587 0.3382 0.8144 0.0131 0.2402 0.7324 0.5706 1.5309 2.7235 4.2940 17.1409 2.9508 1.6614 5.8074 2.5230 0.8160 2.0355 0.0923 8.0099 1.4217 0.0483 0.7455 0.3631 25.0000 2.5357 1.0994 1.7347 3.6986 2.2989 0.6244 0.5429 1.1361 0.1494 0.2680 0.5315 0.7717 4.2895 5.6036 0.9379 2.2933 2.5788 4.9262 4.5928 3.8288 1.1096 6.0359 0.1690 20.2012 9.2327 9.0909 3.9596 1.4557 0.4683 4.0839 2.4687 1.7303 8.7694 5.4252 7.8173 5.8849 5.6991 9.0620 7.1486 1.5859 2.0365 14.4877 29.9132 11.2429 16.6982 15.5631 0.4667 38.2262 9.8604 17.8903 13.8531 31.7369 13.7106 113.7346 70.6499 3.1887 196.7172 13.1702 5.1414 0.4942 0.6158 2.5587 0.1399 34.0476 44.0012 9.3401 22.5749 1.8186 4.1098 1.7718 22.2021 9.5927 3.6037 13.7745 14.0763 12.5959 9.9258 3.5843 0.7493 16.9453 16.7875 0.8272 2.6959 7.8559 2.8111 3.8350 9.8667 24.1169 24.9260 25.6938 13.3947 15.6918 4.8887 7.1877 21.6632 0.8445 19.4284 2.1278 16.8671 1.3446 50.6701 41.1342 28.0468 2.3725 13.5251 19.7483 3.9009 9.1162 11.7501 18.4524 21.5892 0.0463 2.9551 0.4405 1.9427 6.8847 12.1774 29.6713 14.4530 14.6286 10.0415 7.2335 2.0886 0.3305 1.4019 5.2527 1.1967 14.4370 6.3500 3.2937 1.0546 1.3779 1.5323 1.5724 0.9536 4.4934 6.3182 2.1087 1.5653 0.2487 1.1520 3.9093 1.2882 11.0515 9.7603 8.8363 6.6453 1.1178 18.3148 7.8596 21.2953 19.6927 5.5690 5.3507 19.2379 19.9524 21.8116 11.7192 10.7095 1.4928 40.5441 193.9941 5.0176 34.3742 25.7586 23.9020 30.0866 76.7943 128.0722 71.0520 129.4175 161.9811 26.8023 17.3746 10.6011 81.6696 10.1089 12.8294 67.4554 11.3868 43.6602 8.0206 58.6885 38.2567 43.9951 14.2902 0.9906 32.2550 12.8809 13.3565 19.7017 68.4641 10.4542 93.0956 36.9873 22.4738 36.3570 23.9900 6.5807 20.1822 37.1396 17.5819 54.5182 40.2852 16.6861 33.3169 15.9995 23.2428 8.9567 25.1997 20.6750 7.5934 11.9417 9.4430 56.4932 4.8825 3.1856
temp: 298.150 k
press: 1.00000 atm
elementType: 7 7 7 6 1 1 1 6 6 1 1 6 1 1 6 1 1 1 6 1 1 6 1 1 6 1 1 1 11 1 1 1 6 1 1 1 6 6 6 6 1 1 1 1 1 1 1 1 6 6 6 6 6 1 1 1 1 1 1 1 1 1 1 7 6 1 1 6 1 6 1 1 14 6 1 1 1 6 1 1 1 6 1 1 1
symmnumber: 1
zpe: 2031248.1 jmol-1
zpe.correction: 0.773662 hartree
zpe.thermalcorrener: 0.813895 hartree
zpe.thermalcorrenthalpy: 0.814839 hartree
zpe.thermalcorrgfe: 0.704366 hartree
zpe.sumelectzpe: -1617.425407 hartree
zpe.sumelectthermal: -1617.385174 hartree
zpe.sumelectthermalent: -1617.384230 hartree
zpe.sumelectthermalfe: -1617.494703 hartree
dipole: -4.4642 -7.1849 1.1952
dipole: 8.5429
quadrupole: -206.5835 -196.7930 -201.5279
quadrupole: 7.3390 5.4265 1.0275
quadrupole: -4.9487 4.8418 0.1069 7.3390 5.4265 1.0275
hfenergy: -1618.199069 hartree
pointgroup: C01 [X(C24H55N4Na1Si1)]
dipole: -1.7548264 -2.827708 0.4702172 debye
polarizability: 366.7021785|-20.6305862|339.9392617|4.0418022|1.7808738|292.4142254 unknown
InChI: InChI=1S/C9H23N3.C9H18N.C6H14Si.Na/c1-10(2)6-8-12(5)9-7-11(3)4;1-8(2)6-5-7-9(3,4)10-8;1-5-6-7(2,3)4;/h6-9H2,1-5H3;5-7H2,1-4H3;5-6H,1-4H3;/q;-1;;+1
charge 0 multiplicity 1
85 atoms
N  0.46112162 -2.2582977 1.58431193
N  -3.33282715 -1.37570745 -0.00713466
N  -0.9240724 -2.9015449 -1.08636208
C  -0.18250622 -2.83450822 -2.34313072
H  -0.23225262 -3.78214961 -2.90761039
H  0.86744247 -2.6061019 -2.14849998
H  -0.58611117 -2.03468898 -2.97055998
C  0.83851046 -3.31702724 0.64450038
C  -0.313401 -3.87825781 -0.17836982
H  0.05942796 -4.74976614 -0.74413577
H  -1.08214304 -4.2696831 0.4925512
C  -2.33177268 -3.2170516 -1.33658263
H  -2.46789651 -4.29023537 -1.56100403
H  -2.64415848 -2.67318507 -2.23333768
C  -0.38292891 -2.75478647 2.66426009
H  -0.62038387 -1.93154021 3.3442042
H  0.10930723 -3.55433063 3.24699973
H  -1.32641411 -3.14814325 2.27914292
C  -3.23502336 -2.82381352 -0.17193069
H  -4.23149985 -3.27974365 -0.31470947
H  -2.83807828 -3.24794565 0.75522669
C  -4.30720576 -0.81965213 -0.94071808
H  -4.02407806 -1.0443404 -1.97208947
H  -4.34387933 0.26512512 -0.84034339
C  -3.69046575 -1.01527602 1.36014478
H  -2.92845537 -1.38275399 2.05433164
H  -4.66907705 -1.42545567 1.66720769
H  -3.7260649 0.07292896 1.45064745
Na -0.7746406 -0.55257976 -0.02025289
H  1.31780255 -4.15854071 1.18044773
H  1.5945115 -2.89437681 -0.02321451
H  -5.31976727 -1.22551048 -0.76407701
C  1.6849166 -1.6891463 2.14835094
H  1.43844264 -0.92182964 2.88462047
H  2.30364391 -2.4593201 2.64244459
H  2.26120251 -1.22265904 1.34778224
C  -0.55028256 2.44771443 1.28534083
C  -1.83350168 2.57591088 -0.85096574
C  0.5070333 1.52682252 1.90939585
C  -1.9369754 1.77925082 -2.16360685
H  1.02773883 3.69242472 0.50227254
H  -0.34268483 3.8463923 -1.76913264
H  1.00345995 1.9983564 2.76505778
H  -2.56007241 2.3016055 -2.89812243
H  0.02214574 0.61052058 2.2720459
H  -2.3900208 0.79947619 -1.97026116
H  1.27152196 1.2461747 1.18081069
H  -0.95265808 1.61694243 -2.60839998
C  0.0694832 3.83911281 1.01536325
C  -1.67191603 2.57446073 2.34228839
C  -1.23448668 3.97382257 -1.14479175
C  -3.27896819 2.75717402 -0.32358944
C  -0.83375819 4.7091527 0.13753998
H  0.2858866 4.35139295 1.9621146
H  -2.40068114 3.35358678 2.1150496
H  -2.21002236 1.62334687 2.42572469
H  -1.24076959 2.81108589 3.322843
H  -1.94677631 4.57849241 -1.72192541
H  -3.97460647 2.93342761 -1.15312607
H  -3.38221597 3.60227653 0.36000733
H  -3.59698617 1.86141875 0.2156573
H  -0.32033733 5.64373694 -0.11565568
H  -1.72931439 5.00264532 0.7004517
N  -0.95479827 1.79926196 0.03218611
C  2.65662403 -0.53114247 -1.13967568
H  2.64563843 -1.59052387 -1.41114608
H  0.2321953 1.72242898 -0.68748725
C  1.67391387 0.24695778 -1.67381576
H  0.94151414 -0.25327459 -2.32318624
C  1.38387365 1.64656657 -1.44341421
H  2.18445212 2.19170724 -0.9328826
H  1.10347882 2.17225123 -2.36183165
Si 4.23725213 0.06642495 -0.35342532
C  5.22883933 1.07190901 -1.60702989
H  4.63348225 1.92017025 -1.96046859
H  6.15628747 1.4626427 -1.1743092
H  5.48764434 0.46333073 -2.47925708
C  5.2186183 -1.47549249 0.13561429
H  6.19667448 -1.21134037 0.55113444
H  4.68387032 -2.06133133 0.89216343
H  5.38834311 -2.12529833 -0.72974627
C  4.05704992 1.13985037 1.1948318
H  3.53011494 0.62867981 2.00629348
H  5.05360266 1.40939027 1.56371824
H  3.51833897 2.0691747 0.98614535
