program: Gaussian 16
title: Li-PMDETA-TMP-HAllylsilaneE TS opt NH dist 1.454 A
version: ES64L-G16RevC.01
frameworkgroup: C1[X(C24H55LiN4Si)]
method: RwB97XD
basis: Gen
operation: Freq
keyword: #P
keyword: Geom=AllCheck
keyword: Guess=TCheck
keyword: SCRF=Check
keyword: GenChk
keyword: RwB97XD/ChkBas
keyword: Freq
converged: YES YES YES YES
title: Mulliken charges:
elementType: N N N C H H H C C H H C H H C H H H C H H C H H C H H H H H H C H H H C C C C H H H H H H H H C C C C C H H H H H H H H H H N C H H C H C H H Si C H H H C H H H C H H H Li
charge: -0.569040 -0.539707 -0.566205 -0.197747 0.142714 0.156177 0.158170 -0.053774 -0.073488 0.145924 0.133009 -0.059000 0.135614 0.168563 -0.198822 0.154611 0.142356 0.134651 -0.059791 0.100122 0.142895 -0.201786 0.129003 0.143165 -0.193513 0.136393 0.115212 0.134185 0.138626 0.139540 0.117260 -0.195440 0.156472 0.145258 0.146549 0.190863 0.178795 -0.327985 -0.327049 0.104528 0.114896 0.107359 0.110408 0.081902 0.085017 0.124774 0.128917 -0.191013 -0.335196 -0.187248 -0.330153 -0.225604 0.085437 0.101543 0.115587 0.100237 0.085905 0.097379 0.092258 0.137270 0.103999 0.095619 -0.582483 -0.527863 0.102892 0.307637 -0.013660 0.095008 -0.354913 0.125600 0.094379 0.791265 -0.589465 0.123358 0.123948 0.125277 -0.568703 0.122371 0.122873 0.116889 -0.595886 0.125470 0.126028 0.116105 -0.012727
chargesum: -0.00000
title: Mulliken charges with hydrogens summed into heavy atoms:
elementType: N N N C C C C C C C C C C C C C C C C C C N C C C Si C C C Li
charge: -0.569040 -0.539707 -0.566205 0.259314 0.224392 0.205445 0.245177 0.232797 0.183226 0.187642 0.192277 0.252839 0.190863 0.178795 -0.013950 -0.002707 -0.001048 -0.017829 0.013552 -0.003246 -0.025985 -0.582483 -0.117334 0.081348 -0.134933 0.791265 -0.216882 -0.206570 -0.228283 -0.012727
polarizability: 3.60675490e+02 1.15794996e+00 3.27388722e+02 -4.91397860e+00 -5.07422307e+00 2.89470142e+02
1716.lowfreq: -1353.8352 -9.2258 -4.2439 0.0008 0.0010 0.0013 4.6376 33.8850 50.6663
frequency: -1353.8352 33.8779 50.6367 54.9144 57.1039 62.0492 66.4210 76.0715 81.8117 87.9190 95.3545 113.0059 116.9089 124.9167 125.4117 145.6388 148.7200 149.8317 151.9644 156.4034 160.7928 162.7092 169.6445 171.8076 182.5488 196.0489 200.0197 205.5683 216.8757 219.2963 225.8891 237.0914 240.6690 253.3247 258.5785 263.0291 265.6861 275.2119 276.0664 285.2073 286.6890 301.8110 311.6442 313.1405 321.1931 329.6138 337.7997 344.3824 348.2124 352.0075 369.1821 372.7239 398.6293 402.8746 411.7241 416.7335 424.5946 444.2755 449.3901 458.7936 468.4136 475.1788 494.1186 502.2726 508.4351 521.8335 527.8141 599.9953 609.2766 614.0577 628.9233 683.2615 687.5808 692.3736 699.6747 737.6693 754.9865 769.5574 778.5109 800.7330 809.2342 822.8551 825.4815 844.4692 865.3006 873.1494 873.5438 875.9653 899.2841 903.8493 914.5138 924.5428 936.3376 942.1900 942.9355 967.5694 972.8052 985.1274 995.0154 1004.3810 1004.9350 1015.7051 1044.5827 1050.3287 1051.1177 1064.7695 1075.4805 1077.0702 1079.3673 1084.3824 1087.0898 1103.3267 1111.4400 1113.6967 1120.9810 1135.9715 1137.4577 1162.0284 1170.2133 1175.0337 1190.4131 1198.4230 1211.6139 1231.5804 1233.9819 1243.0652 1246.8640 1252.9341 1254.0866 1263.8176 1273.9872 1284.4119 1294.4528 1306.9243 1307.3236 1309.8817 1317.6478 1324.1477 1331.8083 1338.0334 1338.7740 1343.3153 1352.0048 1361.2412 1380.0732 1384.8009 1393.5381 1397.7152 1401.6106 1407.3238 1411.5097 1417.8250 1426.9061 1446.2043 1455.5453 1458.0236 1463.7986 1467.7984 1471.6069 1472.1750 1473.7176 1477.9367 1483.2497 1484.2578 1485.1273 1488.8271 1489.9908 1491.8572 1493.5133 1494.1191 1496.0008 1497.5944 1500.3457 1501.8773 1503.6248 1504.8850 1505.8751 1508.5063 1510.8011 1512.7298 1513.5420 1517.8604 1519.3157 1520.7867 1523.2986 1524.5002 1526.1081 1529.0680 1531.9357 1533.7953 1537.3273 1543.7819 1550.9876 1640.6115 1667.1522 2925.7408 2941.7582 2951.4558 2972.8342 2986.7441 2987.7716 2991.7748 2994.0163 3010.2562 3049.8819 3050.3564 3051.1159 3054.8281 3055.7871 3058.4587 3062.2269 3063.4181 3067.0808 3073.4931 3076.5858 3091.9480 3095.7417 3110.2940 3110.7231 3111.7507 3112.1093 3120.5561 3122.5695 3124.2891 3125.9483 3133.5598 3133.6344 3134.6294 3135.8156 3137.2863 3138.9475 3139.8810 3141.0107 3152.1703 3153.7326 3156.5904 3158.2617 3158.9496 3159.0224 3160.3744 3165.3568 3173.6524 3176.0174 3181.6073 3183.0418 3191.7249 3202.1344 3203.2398 3245.2332
redmass: 1.0912 3.3916 2.8998 3.4542 3.8369 3.8984 3.1744 3.1926 3.1383 3.3372 4.0348 2.6441 3.0101 2.9008 3.3054 2.2832 2.0884 1.9184 1.9022 1.7330 2.4332 2.2185 1.2587 2.8256 1.4530 1.8169 1.4644 2.2131 1.5271 1.8143 1.6446 1.6867 1.4931 1.6002 1.9740 1.5034 1.3234 1.2872 1.3754 1.2226 1.6753 4.1170 1.7532 1.9614 1.8840 2.4390 2.7789 3.0417 2.4550 2.4876 2.5264 2.3270 2.5084 2.6885 2.3100 2.2440 2.0921 2.0596 2.6187 2.3144 2.4912 2.1782 2.2265 2.9742 2.4857 2.7047 2.7579 2.8139 2.6678 2.6551 2.7848 1.4773 1.2284 2.3707 2.0977 2.5811 1.5500 1.5101 2.7232 1.4882 2.2558 1.6076 1.6013 1.7993 1.5748 1.7470 1.9410 1.5427 3.6426 1.7792 2.5457 1.9922 1.7420 1.6370 1.5169 1.6223 2.2100 1.5595 1.4140 1.3857 2.1246 1.4622 1.5617 1.9921 1.7882 1.9079 1.5726 1.9750 1.6222 1.5271 1.6548 1.7956 1.4351 1.7564 1.8200 1.3375 1.3319 1.7285 1.4320 1.9552 2.2395 1.4854 1.7833 2.2853 2.3291 2.1558 2.7869 1.5232 2.0113 1.7125 2.4783 2.4328 2.1276 2.0348 1.3406 1.2863 1.2389 1.4190 2.5479 1.3555 1.2906 1.6225 1.3529 1.1530 1.4581 1.5011 1.5249 1.2995 1.4352 1.4122 1.3430 1.2358 1.2394 1.4368 1.3998 1.1947 1.1753 1.2075 1.0554 1.0543 1.0555 1.1940 1.0569 1.0585 1.0514 1.0835 1.0652 1.0878 1.1438 1.0921 1.0651 1.0919 1.0617 1.0586 1.0718 1.0642 1.0685 1.0683 1.0493 1.0627 1.0673 1.0514 1.1037 1.0547 1.0633 1.0654 1.0725 1.0781 1.0832 1.0642 1.0876 1.0789 1.0647 1.1167 3.1461 1.0705 1.0596 1.0601 1.0722 1.0565 1.0699 1.0568 1.0578 1.0747 1.0595 1.0358 1.0442 1.0369 1.0606 1.0392 1.0735 1.0637 1.0492 1.0469 1.0447 1.1017 1.0887 1.0743 1.0856 1.0997 1.0733 1.0999 1.0864 1.0802 1.0925 1.0851 1.0985 1.0955 1.0781 1.1008 1.0928 1.1003 1.1003 1.0917 1.1002 1.0992 1.0820 1.0968 1.0831 1.0839 1.1028 1.1039 1.0928 1.1023 1.1032 1.0965 1.0989 1.0982 1.1146
irintensity: 4334.6969 0.3571 0.5528 0.0518 0.0720 0.4225 0.7036 0.1297 0.0067 0.2482 0.2137 0.1150 0.0701 0.1070 0.0666 0.1594 0.2019 0.2679 0.0508 0.1194 0.8178 0.5476 0.4555 0.6737 0.5259 0.3228 0.0110 0.9741 2.5605 0.1306 0.0615 0.7561 0.0374 0.6454 1.8590 0.2958 0.5301 0.0659 0.6581 0.3642 0.3859 26.5066 3.8968 4.3205 3.2486 15.6741 8.2254 43.0177 4.8285 13.1739 10.6368 0.5900 7.4089 4.6899 1.8193 1.8697 14.9912 11.8773 28.0622 20.8660 23.2000 7.3797 5.1677 0.3978 0.6828 0.9764 34.5929 3.1750 2.4557 6.7326 26.0231 17.5742 5.3397 10.0391 5.9176 2.4650 9.8941 31.2696 1.5000 157.6429 11.5823 32.8846 11.6344 10.7437 53.0530 74.9463 11.5510 12.7383 44.8349 165.0460 21.8388 45.2857 11.7876 5.0867 19.1357 2.0354 14.2258 4.1284 35.3678 0.3302 15.8450 0.2643 11.4116 2.4195 19.5828 24.0688 20.5238 14.0672 2.3403 9.4700 2.9933 31.8561 1.3431 1.9338 12.6315 3.9723 7.4902 13.7904 8.5007 26.4987 94.9407 10.8225 26.4243 7.9588 2.2865 14.0406 16.9612 11.0417 5.3739 0.6433 16.3028 1.0938 34.0595 2.4306 35.8359 46.4452 34.5871 1.3322 12.2010 7.7284 13.8015 26.3184 15.3949 4.3454 0.1936 7.4792 4.3717 0.6523 0.9264 10.9363 9.9011 18.9941 14.0574 5.1057 0.9900 4.0520 0.6572 13.9208 0.9231 1.8029 0.3038 0.9448 1.6166 0.2817 3.5031 2.9230 4.4642 4.5998 0.7550 4.1157 3.1308 3.2312 4.9274 2.2095 9.1011 15.8745 1.3859 7.4864 29.3123 3.8976 6.9267 12.1013 30.2045 1.6878 8.4103 15.1426 21.1480 14.8251 15.9253 4.3409 24.5490 46.2978 27.7860 23.2677 151.4211 68.6854 44.6099 141.8464 39.0670 20.9690 33.9818 136.1496 83.5037 107.1784 20.6077 10.9876 16.1368 11.8543 47.6302 4.0528 17.1302 43.5555 26.9088 78.5961 16.4249 33.2748 9.4893 18.7788 30.8628 18.5797 43.9733 49.4324 7.2100 17.4094 21.4981 25.3628 15.9031 51.4071 25.7245 21.3696 14.5930 25.4660 31.6874 39.2390 9.6657 18.3873 12.7872 13.6680 44.5668 12.6581 16.4588 12.3250 11.2177 8.7867 11.2795 17.2318 31.3246 8.6007 29.1040
temp: 298.150 k
press: 1.00000 atm
elementType: 7 7 7 6 1 1 1 6 6 1 1 6 1 1 6 1 1 1 6 1 1 6 1 1 6 1 1 1 1 1 1 6 1 1 1 6 6 6 6 1 1 1 1 1 1 1 1 6 6 6 6 6 1 1 1 1 1 1 1 1 1 1 7 6 1 1 6 1 6 1 1 14 6 1 1 1 6 1 1 1 6 1 1 1 3
symmnumber: 1
zpe: 2037109.6 jmol-1
zpe.correction: 0.775894 hartree
zpe.thermalcorrener: 0.815405 hartree
zpe.thermalcorrenthalpy: 0.816349 hartree
zpe.thermalcorrgfe: 0.709377 hartree
zpe.sumelectzpe: -1462.689809 hartree
zpe.sumelectthermal: -1462.650298 hartree
zpe.sumelectthermalent: -1462.649354 hartree
zpe.sumelectthermalfe: -1462.756326 hartree
dipole: 6.7599 3.4344 1.3389
dipole: 7.6996
quadrupole: -198.6670 -195.2095 -197.9731
quadrupole: 8.4327 -2.9805 2.2984
quadrupole: -1.3838 2.0737 -0.6899 8.4327 -2.9805 2.2984
hfenergy: -1463.4657027 hartree
pointgroup: C01 [X(C24H55Li1N4Si1)]
dipole: -2.6347602 -1.407059 0.5046178 debye
polarizability: 360.5482575|1.7849868|327.4132738|5.2806261|5.3178548|289.5728234 unknown
InChI: InChI=1S/C9H23N3.C9H18N.C6H14Si.Li/c1-10(2)6-8-12(5)9-7-11(3)4;1-8(2)6-5-7-9(3,4)10-8;1-5-6-7(2,3)4;/h6-9H2,1-5H3;5-7H2,1-4H3;5H,1,6H2,2-4H3;/q;-1;;+1
charge 0 multiplicity 1
85 atoms
N  -1.10816059 -2.62487475 1.25012815
N  -4.40092669 1.54269126 -0.16304119
N  -2.46239044 -1.53066451 -1.17184848
C  -2.10570881 -2.00784133 -2.5105915
H  -2.99733658 -2.3259364 -3.07695214
H  -1.41974175 -2.85301944 -2.43691496
H  -1.59935122 -1.2172837 -3.06835211
C  -1.90003916 -3.43872166 0.32380492
C  -2.99459329 -2.64935745 -0.37856901
H  -3.57551249 -3.33713463 -1.01493361
H  -3.69441895 -2.26312665 0.36367378
C  -3.44450577 -0.44389014 -1.29170462
H  -4.39057782 -0.8371158 -1.70248927
H  -3.05737456 0.28545096 -2.00972155
C  -1.92417088 -2.15002149 2.36840939
H  -1.28280652 -1.68003233 3.11613246
H  -2.47190641 -2.97523407 2.85586496
H  -2.642605 -1.39801353 2.03728377
C  -3.67620846 0.2964224 0.02398509
H  -4.20092653 -0.34654808 0.75941873
H  -2.68971371 0.53125101 0.4407601
C  -5.78314669 1.32802977 -0.55731315
H  -5.83771334 0.81649527 -1.52112678
H  -6.28122146 2.29433979 -0.67161516
C  -4.32745683 2.36011768 1.03682151
H  -3.28271616 2.5741104 1.27487865
H  -4.7934746 1.87323857 1.91511875
H  -4.83796385 3.31132446 0.86327614
H  -2.36591758 -4.29262255 0.84964468
H  -1.21303158 -3.85596784 -0.41819336
H  -6.35001364 0.73267444 0.18510635
C  0.00580741 -3.42162636 1.76324781
H  0.65063101 -2.79860849 2.38739009
H  -0.34548417 -4.2785789 2.36318516
H  0.60202942 -3.80189672 0.93153716
C  0.64984993 1.33783268 1.41976866
C  0.16405652 1.9472926 -0.96266506
C  1.07523185 0.08907198 2.20513401
C  0.03443137 1.24931455 -2.32454003
H  2.74019605 1.79598656 1.22026926
H  2.26197381 2.32436902 -1.31475437
H  1.39285752 0.34846924 3.22099714
H  -0.06202237 1.98069468 -3.13392454
H  0.22945722 -0.59922981 2.27952682
H  -0.86795605 0.62749779 -2.32840096
H  1.89733119 -0.4311988 1.71311301
H  0.89018444 0.6099534 -2.54119794
C  1.82065224 2.34731216 1.44080251
C  -0.55818422 1.92027064 2.18745386
C  1.38647216 2.89191479 -0.97769482
C  -1.11906365 2.79731252 -0.82414385
C  1.67063537 3.46702497 0.41098674
H  1.93757886 2.76598966 2.44882453
H  -0.84452745 2.91978727 1.85725553
H  -1.4259434 1.26106235 2.07143233
H  -0.32751719 1.98954673 3.25744086
H  1.22963152 3.70322596 -1.70001789
H  -1.23561464 3.43113355 -1.71127979
H  -1.11141304 3.46535768 0.03738405
H  -2.00904895 2.16858922 -0.75760737
H  2.58497529 4.07173008 0.38692169
H  0.86532255 4.15067858 0.70867606
N  0.34746038 0.88443901 0.04853872
C  2.60200156 -0.46731806 -0.84278372
H  2.57004028 -0.14915262 -1.89400382
H  1.57908128 0.27926641 -0.33329398
C  2.02552021 -1.79528478 -0.70177359
H  2.25610653 -2.32919233 0.2262907
C  1.12723529 -2.38761852 -1.52464187
H  0.87775697 -1.94760177 -2.48778093
H  0.7469498 -3.38611314 -1.32631904
Si 4.35815776 -0.24309876 -0.25813895
C  4.96281778 1.50223317 -0.66170179
H  6.02892639 1.60380622 -0.43089578
H  4.83415533 1.71682028 -1.72850883
H  4.42439532 2.27376391 -0.10317669
C  5.51196929 -1.44978457 -1.15348015
H  5.22829342 -2.48734486 -0.94482517
H  5.45676087 -1.30858797 -2.23837625
H  6.55665491 -1.31848735 -0.84936252
C  4.5811849 -0.56646935 1.59510161
H  5.64817893 -0.59779894 1.84182974
H  4.11727484 0.20708769 2.21417341
H  4.15054724 -1.53059892 1.89014016
Li -0.49637057 -0.92838801 -0.17771445
