program: Gaussian 09
title: 000042266
version: EM64L-G09RevD.01
frameworkgroup: C1[X(C18H14Cl2O4)]
method: RPBEPBE
basis: SDD
operation: Freq
keyword: #p
keyword: freq=noraman
keyword: PBEPBE/SDD
title: #p freq=noraman PBEPBE/SDD
converged: YES YES NO NO
title: Mulliken charges:
elementType: Cl Cl O O O O C C C C C C C C C C C C C C C C C C H H H H H H H H H H H H H H
charge: 0.052841 0.053628 -0.148085 -0.216518 -0.423989 -0.176482 0.056659 -0.656681 0.402635 0.019047 0.283149 0.477953 -0.797447 -0.582537 -0.308049 -0.384824 -0.414858 0.516064 -0.412008 -0.246845 -0.235091 -0.243829 -0.337213 0.162445 0.273274 0.246073 0.234719 0.224318 0.254773 0.266787 0.229939 0.243173 0.225637 0.224898 0.229551 0.255584 0.255694 0.395615
chargesum: 0.00000
title: Mulliken charges with hydrogens summed into heavy atoms:
elementType: Cl Cl O O O O C C C C C C C C C C C C C C C C C C
charge: 0.052841 0.053628 -0.148085 -0.216518 -0.028373 -0.176482 0.056659 -0.137334 0.402635 0.019047 0.283149 0.477953 -0.083637 -0.315750 -0.308049 -0.154885 -0.171685 0.516064 -0.412008 -0.021208 -0.010193 -0.014278 0.174066 0.162445
polarizability: 3.34935996e+02 -8.78029547e+00 2.12329261e+02 8.56817299e+00 -7.29473106e+00 1.55548674e+02
1716.lowfreq: -0.0005 0.0013 0.0015 1.9437 4.4505 6.1023 8.9690 22.3871 26.5203
frequency: 7.5089 22.3852 26.4948 30.2950 50.6467 64.7206 76.4328 94.8354 129.2257 155.6063 156.1922 174.7262 192.0290 200.9630 231.1455 238.3597 249.0732 265.0113 281.5007 316.7681 325.2463 335.3008 346.9685 393.3185 402.6688 430.1150 448.7964 481.1648 511.5644 514.3818 542.3766 561.2722 595.3517 599.4186 616.4760 623.3781 627.0123 638.0366 676.0575 698.6857 703.9251 718.8732 767.8792 780.9746 809.3485 840.0543 846.6384 850.9906 880.0752 907.6886 921.0384 940.2320 959.8710 974.0932 976.0971 991.0437 995.2457 1004.2927 1024.3682 1033.7094 1064.1977 1068.6859 1077.7981 1111.1717 1134.4614 1144.0189 1173.3127 1177.4928 1197.9645 1200.3380 1208.7589 1246.7483 1256.4450 1275.8406 1287.1643 1323.6703 1367.9342 1378.4564 1383.5220 1386.0960 1400.6681 1430.8900 1434.5327 1452.9510 1460.5590 1479.7180 1483.8421 1486.4016 1561.8745 1590.9752 1591.2472 1613.4968 1638.5209 1710.7119 2974.0794 2983.1584 2996.0480 3035.1848 3046.3746 3076.1583 3094.4337 3106.8786 3126.7308 3139.2883 3155.1782 3157.0446 3167.3106 3529.4513
redmass: 5.1020 12.5316 5.9540 5.0173 8.5060 9.0216 9.4345 6.6562 2.7648 7.3899 7.5438 4.4297 6.7296 21.4468 9.0745 3.7656 4.8167 6.3228 5.5405 1.0983 3.8220 7.4836 3.5074 10.1087 2.7988 5.6759 4.4031 3.8469 1.8990 4.6300 4.1105 5.1930 6.5108 6.3315 6.3843 6.0585 1.5360 3.9648 7.1147 6.7597 1.7398 4.4955 2.4319 4.3045 3.6832 3.4572 2.0012 1.2609 4.0676 1.9329 1.7738 1.8392 4.2095 4.4341 1.4191 4.6598 1.4060 1.8724 2.6115 3.2445 2.1606 3.9339 1.8289 1.7745 6.4925 2.5516 1.0928 1.6483 1.1201 1.5374 1.0750 2.2698 1.7655 2.0900 6.1727 1.3566 2.5284 5.2895 3.5633 1.4491 3.8553 2.4800 2.2279 1.1653 1.2291 1.1101 1.1947 1.6569 8.0616 8.2344 6.0044 6.1510 11.5838 9.5134 1.0555 1.0350 1.0604 1.1045 1.1017 1.0998 1.1006 1.0882 1.0859 1.0922 1.0950 1.0913 1.0996 1.0644
irintensity: 0.0426 0.9760 0.1141 0.0664 0.2193 1.0443 0.6638 2.3244 7.6472 1.3614 1.2863 0.5962 0.3888 0.1870 0.0833 0.4742 0.5900 1.6241 1.7085 0.1928 0.3982 0.3121 1.3076 4.0164 0.0212 17.5288 4.9976 9.3867 42.7374 11.9615 0.5808 17.7625 5.2882 23.0570 0.2502 14.7181 133.0220 27.9845 5.1266 37.2211 50.0945 6.1372 20.4931 7.4295 6.1558 25.2893 29.1013 0.9487 2.2215 7.2407 8.4596 0.9014 111.5423 22.9279 1.1846 0.1328 0.0610 0.1004 26.9088 467.3662 6.3331 2.9795 11.3744 4.2487 150.4242 21.3936 1.9268 20.4357 1.0394 13.9711 1.0640 30.8246 95.2619 57.8186 243.8643 0.6093 1.1752 3.0957 40.7227 26.9195 88.9632 71.3668 3.0744 20.6922 21.8099 15.4788 22.8840 5.1048 66.0630 376.6096 9.1266 13.1869 106.9781 198.5924 36.6339 19.5423 15.5348 11.5258 9.0666 35.0029 12.7757 17.9682 0.0735 24.2451 34.0688 10.1411 19.4867 46.4707
temp: 298.150 k
press: 1.00000 atm
elementType: 17 17 8 8 8 8 6 6 6 6 6 6 6 6 6 6 6 6 6 6 6 6 6 6 1 1 1 1 1 1 1 1 1 1 1 1 1 1
symmnumber: 1
zpe: 721621.8 jmol-1
zpe.correction: 0.274851 hartree
zpe.thermalcorrener: 0.296982 hartree
zpe.thermalcorrenthalpy: 0.297927 hartree
zpe.thermalcorrgfe: 0.219342 hartree
zpe.sumelectzpe: -1913.612239 hartree
zpe.sumelectthermal: -1913.590108 hartree
zpe.sumelectthermalent: -1913.589164 hartree
zpe.sumelectthermalfe: -1913.667748 hartree
dipole: -0.8657 -7.7879 1.2456
dipole: 7.9342
quadrupole: -147.0962 -153.7516 -144.0395
quadrupole: 10.4875 -2.1449 -0.2583
quadrupole: 1.1996 -5.4558 4.2562 10.4875 -2.1449 -0.2583
hfenergy: -1913.8870905 hartree
pointgroup: C01 [X(C18H14Cl2O4)]
dipole: 0.4707985 -3.0849507 0.074383 debye
polarizability: 333.8745583|15.2736998|214.1336961|6.8267475|-3.0519|154.805677 unknown
InChI: InChI=1S/C18H14Cl2O4/c1-18(11-5-3-2-4-6-11)8-10-7-12(24-9-13(21)22)15(19)16(20)14(10)17(18)23/h2-7,21H,8-9H2,1H3
charge 0 multiplicity 1
38 atoms
Cl 0.272484 3.75913 -0.564345
Cl 3.377603 2.941313 -0.08341
O  -2.398807 2.113123 -0.941777
O  3.844149 0.084847 0.052332
O  6.21175 -2.631575 0.453776
O  6.558114 -0.322747 0.464562
C  -2.236669 -0.382717 -0.982432
C  -1.019745 -1.29078 -0.594434
C  0.170409 -0.354029 -0.473819
C  -1.691592 1.085203 -0.818593
C  -0.223564 1.003205 -0.571018
C  -3.452115 -0.608065 -0.066564
C  -2.564192 -0.542352 -2.492382
C  1.512947 -0.714069 -0.269754
C  0.749852 2.026713 -0.449001
C  -3.29912 -0.43449 1.336629
C  -4.728382 -0.973496 -0.558212
C  2.485135 0.31007 -0.152202
C  2.099227 1.684739 -0.240305
C  -4.380461 -0.631547 2.219286
C  -5.815801 -1.175245 0.323796
C  -5.647847 -1.008159 1.715282
C  4.286567 -1.29956 0.146131
C  5.794054 -1.293645 0.368632
H  -1.203519 -1.806477 0.36589
H  -0.84533 -2.07809 -1.351085
H  -1.655728 -0.382097 -3.100963
H  -2.941762 -1.558056 -2.708253
H  -3.318423 0.198734 -2.808421
H  1.793207 -1.768935 -0.200938
H  -2.326222 -0.126935 1.742846
H  -4.890841 -1.098191 -1.632981
H  -4.239537 -0.484875 3.29611
H  -6.794885 -1.457984 -0.079468
H  -6.491454 -1.16093 2.397482
H  3.803407 -1.823747 0.994674
H  4.066064 -1.860111 -0.784105
H  7.195224 -2.669271 0.600234
