program: Gaussian 16
title: Na-PMDETA-Allylsiland-Hallylsilane no TMP TS opt CH dist 1.438A
version: ES64L-G16RevC.01
frameworkgroup: C1[X(C21H50N3NaSi2)]
method: RwB97XD
basis: Gen
operation: Freq
keyword: #P
keyword: Geom=AllCheck
keyword: Guess=TCheck
keyword: SCRF=Check
keyword: GenChk
keyword: RwB97XD/ChkBas
keyword: Freq
converged: YES YES YES YES
title: Mulliken charges:
elementType: Na N N N C C C C C C C C C H H H H H H H H H H H H H H H H H H H H H H H C H C H C H H C H H C H C H H Si C H H H C H H H C H H H Si C H H H C H H H C H H H
charge: 0.493480 -0.658358 -0.668465 -0.647785 -0.074511 -0.075478 -0.200184 -0.053352 -0.199815 -0.184783 -0.050861 -0.209592 -0.197167 0.143001 0.137148 0.139371 0.138060 0.142009 0.146887 0.148504 0.137258 0.123055 0.136907 0.163639 0.139570 0.141406 0.136149 0.175400 0.133024 0.136408 0.145794 0.180395 0.135498 0.139884 0.179587 0.115061 -0.425463 0.086533 0.002944 0.115531 -0.462236 0.084592 0.113579 -0.491682 0.203545 0.050366 -0.013036 0.092015 -0.338585 0.102480 0.069679 0.730217 -0.578808 0.137658 0.125416 0.111941 -0.582304 0.135083 0.122592 0.134789 -0.586438 0.092815 0.134219 0.145237 0.746883 -0.586158 0.122698 0.134993 0.110832 -0.585549 0.123430 0.126294 0.129493 -0.578215 0.124696 0.107082 0.123698
chargesum: -0.00000
title: Mulliken charges with hydrogens summed into heavy atoms:
elementType: Na N N N C C C C C C C C C C C C C C C Si C C C Si C C C
charge: 0.493480 -0.658358 -0.668465 -0.647785 0.205637 0.201953 0.237215 0.206961 0.240301 0.268173 0.218572 0.252095 0.237365 -0.338930 0.118475 -0.060521 -0.441316 0.078979 -0.166427 0.730217 -0.203792 -0.189840 -0.214167 0.746883 -0.217635 -0.206332 -0.222739
chargesum: 0.00000
polarizability: 3.80222331e+02 8.06144612e+00 2.94132537e+02 -2.74586186e+00 3.94528254e+00 2.91011776e+02
1716.lowfreq: -1372.5385 -0.0011 -0.0009 -0.0008 2.2221 3.2616 6.8054 21.4798 30.9242
frequency: -1372.5384 21.4110 30.9232 34.3168 36.3442 42.1406 58.7530 63.9287 67.4561 76.9601 79.3665 82.1227 94.4517 105.4506 112.4579 115.6000 123.0528 127.5209 137.8093 138.6113 152.7875 156.4719 158.3033 163.8075 168.1259 172.9962 180.2025 181.7480 188.7909 192.4917 197.6178 199.5494 205.3020 210.3614 221.0213 225.2829 230.0126 243.3548 250.0638 255.5018 262.2621 281.0470 291.2838 298.4944 308.0712 315.1721 320.9812 323.5360 330.4055 337.7583 351.6521 378.7819 390.7349 394.9961 406.2935 407.0508 438.4483 441.6522 456.5002 470.5363 477.8683 482.2058 571.8582 590.2553 608.5353 614.4540 625.3754 676.1178 680.6588 684.8126 685.4550 688.7102 696.4335 702.8636 740.8008 742.4040 751.3200 768.9911 775.2154 791.6524 800.2810 812.3082 816.3874 818.4551 828.6587 856.5987 864.5168 866.6212 870.7990 885.3602 902.5310 903.4602 927.8159 944.7066 970.1549 982.1108 992.5693 1011.2526 1023.8539 1028.7554 1047.1921 1065.2602 1068.9225 1073.5396 1081.8509 1083.2438 1111.6930 1124.0806 1137.0560 1139.9769 1163.3766 1170.6535 1179.4781 1190.9895 1195.0621 1210.0502 1220.3695 1225.2566 1266.2801 1272.7836 1284.0488 1294.8780 1301.6159 1305.6093 1306.5503 1307.8325 1313.0000 1313.8599 1314.2952 1332.6669 1337.2328 1338.0449 1349.0751 1350.3108 1361.2648 1407.3476 1415.6257 1442.9079 1451.5188 1456.9383 1458.7208 1460.8844 1469.5086 1470.5108 1472.2810 1472.9213 1474.2211 1475.3049 1475.9715 1477.6078 1481.3941 1482.0800 1484.6003 1486.3692 1488.6533 1490.5170 1491.3718 1492.1682 1492.6383 1496.9142 1500.0181 1501.5213 1502.2745 1504.8422 1510.9733 1515.0581 1516.6009 1519.0537 1519.9342 1522.6667 1525.5819 1529.8976 1531.9056 1537.1337 1615.4538 1683.1087 2961.8518 2966.4318 2979.1318 2979.2962 2983.3737 2983.7582 2984.1517 2986.4337 2992.1890 3044.9933 3049.6505 3055.8684 3055.9758 3056.6301 3056.7239 3085.8137 3091.3269 3095.1870 3098.5642 3107.9810 3117.2719 3120.3448 3123.5313 3123.8689 3125.4303 3126.4383 3132.5961 3133.4787 3135.5818 3137.7841 3138.3013 3139.5491 3140.0490 3140.7482 3142.3391 3144.4225 3145.9504 3147.4631 3148.5841 3149.1608 3153.1375 3166.0986 3172.2819 3173.5462 3175.2057 3177.0150 3181.5465 3189.9064 3255.4451
redmass: 1.1662 3.5438 3.6717 2.9897 3.7357 3.4000 3.7132 3.5324 3.3318 3.3498 3.2278 3.8241 4.0500 2.9554 3.0540 2.6926 2.2141 1.4864 2.1648 2.4281 1.7371 3.5401 1.4754 2.0060 1.4788 2.2499 1.4502 3.8781 2.1813 1.5055 2.0732 2.1612 1.8745 2.3643 1.7198 2.1583 2.6913 2.3651 2.3467 1.8997 1.9675 1.2008 1.2971 1.7284 1.6097 1.9364 1.4684 1.7772 2.0460 3.3043 2.0319 2.0727 2.5172 3.2518 2.0303 2.7383 1.9081 2.0117 1.9678 2.0346 2.2935 2.2862 1.2809 2.4396 2.8598 3.0839 2.8109 1.6082 1.6640 1.1922 1.3265 2.2416 2.1593 2.0396 1.4885 1.6873 1.6236 1.4913 1.4830 2.3527 1.7193 2.3804 1.6427 1.4681 3.0393 1.3999 1.6107 1.6587 1.6467 1.6381 1.7836 1.8778 1.9666 1.4016 2.2169 2.1360 1.4345 1.2881 2.0879 1.1624 1.2606 1.9455 1.8063 2.0621 1.5421 1.4985 1.8812 1.6998 1.3173 1.3616 1.4422 1.8415 2.4056 2.4596 1.4798 1.6237 1.4640 1.8877 1.5480 2.7647 2.3901 1.2694 1.2973 1.2705 1.2884 2.1069 1.9351 1.2553 1.2554 1.4261 1.3103 1.3924 1.2976 1.4380 1.3853 1.3970 1.3289 1.4782 1.4201 1.0734 1.1615 1.1673 1.0852 1.0640 1.0810 1.1842 1.0644 1.0663 1.1259 1.0665 1.0924 1.1033 1.0538 1.0640 1.1093 1.0838 1.1137 1.0678 1.0912 1.1042 1.0547 1.0553 1.0722 1.0761 1.0616 1.1012 1.0615 1.0820 1.0814 1.0592 1.0696 1.0581 1.0619 1.0645 3.3756 3.8203 1.0716 1.0712 1.0565 1.0547 1.0586 1.0602 1.0584 1.0693 1.0714 1.0359 1.0356 1.0358 1.0359 1.0357 1.0359 1.0799 1.0888 1.0576 1.0886 1.0833 1.0806 1.0828 1.0810 1.0833 1.0837 1.0977 1.0839 1.0996 1.0870 1.1012 1.0995 1.0999 1.0985 1.0994 1.0985 1.0895 1.0886 1.0971 1.1007 1.1013 1.1009 1.1010 1.0953 1.1020 1.1056 1.0699 1.1016 1.0998 1.1136
irintensity: 6632.5497 0.1323 0.0230 0.0934 0.5010 0.6166 0.2178 0.5581 1.1408 0.1231 0.1018 0.9847 1.5229 0.6816 1.7839 0.2874 1.6733 0.1852 0.1044 0.3286 0.7901 9.2226 1.2173 3.9263 0.5527 5.7349 1.7633 8.7810 4.6973 2.7501 0.5633 4.5920 0.0361 1.0049 2.8388 2.3222 7.5860 0.3606 10.0828 0.7319 1.6453 0.9491 1.5202 5.1042 0.2657 1.5256 0.1840 0.4820 0.6925 28.9512 7.1624 4.0469 3.4674 2.2309 3.8486 16.0508 7.8584 5.5275 2.0895 2.1114 6.4829 15.7365 11.4085 5.8660 5.3096 3.4477 4.4037 20.5007 1.5178 0.2134 2.3888 6.7934 6.6097 5.2032 27.4804 27.3209 14.3519 29.2133 30.1479 10.5528 12.3027 35.7625 19.7193 24.5222 25.1275 44.7659 86.9337 96.7500 85.7285 145.9253 367.9166 46.9267 9.4312 28.6682 27.8039 6.5231 29.8403 17.5840 20.6692 3.0942 40.9186 15.9417 16.8805 7.4646 19.3786 5.8268 17.0121 3.9850 2.4679 5.1039 8.9365 26.9489 16.8757 75.9479 15.8044 15.8359 2.4358 9.9809 0.4562 1.9448 2.0533 38.6487 37.9400 31.1838 38.3545 5.2203 0.4206 62.1021 14.7290 2.1411 96.7050 10.0431 15.1059 18.3901 22.7459 14.4302 11.9215 5.6465 4.8673 0.0500 0.6370 1.5706 4.2467 0.7104 1.5494 21.9191 0.8677 0.1284 0.7932 1.2519 11.5292 1.5067 1.6149 3.9033 11.2504 1.9865 5.3851 9.7277 11.3928 2.4622 2.3969 1.3749 3.1446 7.8909 22.7882 8.9744 15.2587 15.8767 16.7051 19.6200 14.3898 31.2594 8.0307 28.1491 274.4609 129.9364 25.6986 21.5944 27.2590 34.7546 94.2229 18.8688 72.3466 128.3125 218.9311 13.4332 13.2331 7.4389 14.9634 8.9303 7.2436 55.1193 15.5469 31.7423 8.0795 20.4259 12.2900 22.7158 38.4785 28.2499 7.8483 21.7942 6.9139 19.9490 53.5434 16.5269 7.8448 6.3807 36.0525 32.5393 52.2036 25.7152 3.5689 17.2107 22.4090 14.0309 15.1858 5.7010 9.9638 14.1726 57.5475 4.0412 4.6149 4.4028 37.9805
temp: 298.150 k
press: 1.00000 atm
elementType: 11 7 7 7 6 6 6 6 6 6 6 6 6 1 1 1 1 1 1 1 1 1 1 1 1 1 1 1 1 1 1 1 1 1 1 1 6 1 6 1 6 1 1 6 1 1 6 1 6 1 1 14 6 1 1 1 6 1 1 1 6 1 1 1 14 6 1 1 1 6 1 1 1 6 1 1 1
symmnumber: 1
zpe: 1796109.9 jmol-1
zpe.correction: 0.684102 hartree
zpe.thermalcorrener: 0.724566 hartree
zpe.thermalcorrenthalpy: 0.725510 hartree
zpe.thermalcorrgfe: 0.612806 hartree
zpe.sumelectzpe: -1734.929105 hartree
zpe.sumelectthermal: -1734.888641 hartree
zpe.sumelectthermalent: -1734.887697 hartree
zpe.sumelectthermalfe: -1735.000401 hartree
dipole: 3.3539 -7.6367 0.5272
dipole: 8.3573
quadrupole: -199.3926 -188.9098 -187.8369
quadrupole: -6.0413 2.5959 4.0452
quadrupole: -7.3462 3.1367 4.2095 -6.0413 2.5959 4.0452
hfenergy: -1735.6132072 hartree
pointgroup: C01 [X(C21H50N3Na1Si2)]
dipole: -1.3338765 2.9977298 0.2132737 debye
polarizability: 380.1323859|8.4594831|294.2324567|2.9999136|-3.9029121|291.0018008 unknown
InChI: InChI=1S/C12H27Si2.C9H23N3.Na/c1-8-12(14(5,6)7)15-11-9-10-13(2,3)4;1-10(2)6-8-12(5)9-7-11(3)4;/h8-10,12H,1,11H2,2-7H3;6-9H2,1-5H3;
charge 0 multiplicity 1
77 atoms
Na -0.58675813 0.22389122 -0.015223
N  -2.04549208 2.37572828 -0.09619619
N  0.13486892 1.55535517 -2.01876661
N  -0.34005696 1.37510744 2.25009013
C  -1.7299275 3.06751924 -1.34934415
C  -1.62976112 3.17526422 1.05979153
C  -3.47531819 2.08147622 -0.03728056
C  -0.26716369 2.9348927 -1.75769105
C  -0.48339755 1.0428696 -3.2393996
C  1.58678122 1.4529462 -2.12694871
C  -1.41845498 2.3611487 2.32957948
C  -0.35207009 0.56329164 3.46829432
C  0.96954725 2.00943969 2.10187436
H  -1.98755127 4.13960271 -1.28768604
H  -2.36521656 2.64981112 -2.13508353
H  -2.37350618 3.96368067 1.27336692
H  -0.70224484 3.69701452 0.81051714
H  -4.09147741 2.99143868 -0.14309591
H  -3.74114356 1.3818574 -0.83370404
H  -3.73176675 1.6077277 0.91192843
H  -0.09092728 3.57623741 -2.64142806
H  0.3767884 3.32527361 -0.96147992
H  -0.24899391 1.67618241 -4.1133094
H  -0.1200495 0.03297567 -3.43386603
H  -1.56906482 0.98250594 -3.13311235
H  1.98733325 2.03592839 -2.97497964
H  2.05673779 1.81490349 -1.20759411
H  1.864711 0.40540421 -2.2521749
H  -1.2354311 3.07062331 3.15878547
H  -2.3384471 1.82206114 2.58021631
H  -1.30719054 0.03665509 3.54752766
H  0.4423228 -0.18355881 3.41945529
H  -0.2147489 1.18355152 4.37141534
H  1.15553691 2.76897178 2.88165714
H  1.74811827 1.24600854 2.16142092
H  1.06267168 2.49124133 1.12330142
C  -1.56540287 -1.8397218 -1.19425353
H  -1.64442328 -1.0976968 -1.99486207
C  -0.37442631 -2.53480141 -1.0947226
H  -0.3434957 -3.34256008 -0.36018082
C  0.88410266 -2.28051843 -1.72384341
H  0.84644761 -1.6994386 -2.65039275
H  1.53368706 -3.15278369 -1.81834616
C  2.33088989 -0.92826134 0.30920653
H  1.68324994 -1.55391445 -0.79651271
H  1.70556831 -0.02948363 0.38760701
C  2.03226202 -1.91887221 1.33706392
H  2.84473968 -2.60002224 1.59852195
C  0.83707581 -2.19490468 1.8973445
H  0.70942685 -3.01169363 2.60105352
H  -0.05335418 -1.61094307 1.6799841
Si -3.0592242 -2.23371903 -0.19115889
C  -4.6159534 -1.69502222 -1.11983987
H  -4.73888972 -2.28925451 -2.03108136
H  -5.5159203 -1.82115073 -0.50870633
H  -4.56495099 -0.64280581 -1.4219487
C  -3.17508276 -4.07284764 0.21418032
H  -2.28949505 -4.40747775 0.76531355
H  -4.05190526 -4.2891972 0.83428277
H  -3.24387494 -4.6717135 -0.69907995
C  -3.05098181 -1.34287161 1.49569708
H  -2.82755648 -0.27310397 1.40676375
H  -4.0157276 -1.43620743 2.00798418
H  -2.28631266 -1.78383151 2.14526368
Si 4.10487513 -0.47438329 -0.0073067
C  4.53146015 -0.40545068 -1.85445363
H  5.61718373 -0.44322162 -1.99767102
H  4.09196701 -1.25517732 -2.38782978
H  4.1760243 0.51172951 -2.33541411
C  5.2704208 -1.74495509 0.76868465
H  6.31321932 -1.49544934 0.54504814
H  5.1603087 -1.78266232 1.85737652
H  5.07978873 -2.75089319 0.37931912
C  4.52772371 1.22879996 0.7185353
H  5.55383324 1.52970375 0.47927048
H  3.85942006 2.00707513 0.32960836
H  4.42552734 1.2221433 1.8094879
