program: Orca
programVersion: 5.0.4
elementType: C H H H C O H O C H H C H H H
charge: 1
multiplicity: 1
keywords: wB97X-D3BJ Opt Freq def2-TZVPP def2/J RIJCOSX VeryTightSCF
keywords: PAL8 VeryTightOpt defgrid3
frequency: 0.00 0.00 0.00 0.00 0.00 0.00 51.24 67.03 170.90 189.76 266.14 356.10 431.87 588.52 593.66 662.35 820.21 825.32 959.11 998.81 1043.69 1077.97 1141.95 1174.96 1222.26 1312.07 1397.18 1406.96 1440.29 1461.20 1476.14 1489.69 1501.03 1508.35 1519.88 1699.22 3074.02 3084.01 3119.90 3144.95 3164.26 3168.56 3192.87 3207.93 3788.35
frequency: 51.24 67.03 170.90 189.76 266.14 356.10 431.87 588.52 593.66 662.35 820.21 825.32 959.11 998.81 1043.69 1077.97 1141.95 1174.96 1222.26 1312.07 1397.18 1406.96 1440.29 1461.20 1476.14 1489.69 1501.03 1508.35 1519.88 1699.22 3074.02 3084.01 3119.90 3144.95 3164.26 3168.56 3192.87 3207.93 3788.35
formula: C4H9O2
InChI: InChI=1S/C4H9O2/c1-3-6-4(2)5/h5H,3H2,1-2H3
15 atoms
C  -2.156867 -0.763785 0.256656
H  -2.744798 -0.864712 -0.659513
H  -2.767177 -0.243947 0.999968
H  -1.874967 -1.745265 0.627603
C  -0.945288 0.042484 -0.028577
O  -1.008278 1.253202 -0.481962
H  -1.916386 1.563473 -0.610124
O  0.192015 -0.455599 0.17277
C  1.445437 0.324595 -0.102008
H  1.383908 1.21948 0.515383
H  1.407088 0.592999 -1.156659
C  2.600034 -0.571911 0.249927
H  2.602154 -1.47284 -0.363167
H  2.57903 -0.848207 1.303868
H  3.524136 -0.023957 0.057437
totalener: -308.25766773 hartree
nucrepener: 254.98097885 hartree
electener: -563.23864658 hartree
oneelecener: -912.86004027 hartree
twoeener: 349.62139370 hartree
kineticenergy: 306.95052504 hartree
exchangeener: -27.140739689318 hartree
correlationener: -1.993080911972 hartree
xcener: -29.133820601290 hartree
temp: 298.15 k
press: 1.00 atm
thermalcorrenthalpy: 0.00094421 hartree
totalenthalpy: -308.13633684 hartree
totalentropycorr: -0.03689142 hartree
gibbsenthalpy: -308.17322826 hartree
gibbsminuselec: 0.10153983 hartree
chargesum: 1.0000000
charge: -0.232472 0.149364 0.149331 0.148641 0.426112 -0.167735 0.272940 -0.110813 -0.062509 0.155319 0.155353 -0.224585 0.111232 0.111209 0.118613
charge: 0.070566 0.052635 0.052631 0.051399 -0.270494 0.483857 -0.036163 0.415341 0.006739 0.027343 0.027362 0.029143 0.025994 0.025990 0.037656
qa: -0.2325 0.1494 0.1493 0.1486 0.4261 -0.1677 0.2729 -0.1108 -0.0625 0.1553 0.1554 -0.2246 0.1112 0.1112 0.1186
va: 3.8704 0.9932 0.9932 1.0079 4.0066 2.3861 0.9840 2.3906 3.7775 0.9823 0.9823 3.9393 1.0033 1.0033 1.0021
dispcorr: -0.017105187 hartree
energy: -308.276541888269
dipole: 1.99957 -3.31910 -1.31952 -1.63090 2.01935 0.38846 0.63847 -0.80154 -0.16307
quadrupole: 524.59724 -533.16086 -0.01264 .35023 .93658 111.91433 -134.48926 0.09739 0.93263 -0.34744 30.60938 -55.08512 0.99 -0.08 0.04 -26.83523 25.64026 5 6 5 16.93837 -16.27237 1 8 9 -35.87987 35.03085 7 2 0
magnitude: 1.38515 au
magnitude: 3.52076 debye
zeropoint: 0.13167519 hartree
thermalvibcorrection: 0.00477584 hartree
thermalrotcorrection: 0.00141627 hartree
thermaltrasncorrection: 0.00141627 hartree
thermaltotal: -308.13725831 hartree
thermalcorr: 0.00760839 hartree
nonthermalcorr: 0.13167519 hartree
totalcorr: 0.13928358 hartree
totalenthalpy: -308.13631410 hartree
