program: Orca
programVersion: 5.0.4
elementType: C H H H C O H O C H H C H H H
charge: 1
multiplicity: 1
keywords: wB97X-D3BJ OptTS Freq def2-TZVPP def2/J RIJCOSX VeryTightSCF
keywords: PAL8 VeryTightOpt defgrid3
frequency: 0.00 0.00 0.00 0.00 0.00 0.00 -342.59 40.56 41.47 67.08 84.24 182.71 241.07 334.09 455.20 551.30 620.07 623.54 837.44 863.49 917.21 1022.12 1079.25 1163.18 1199.55 1245.54 1246.03 1254.48 1368.30 1372.50 1435.41 1474.10 1481.79 1487.47 1584.45 1792.78 2370.85 3078.12 3148.28 3159.98 3179.32 3205.25 3260.36 3288.84 3836.89
frequency: 40.56 41.47 67.08 84.24 182.71 241.07 334.09 455.20 551.30 620.07 623.54 837.44 863.49 917.21 1022.12 1079.25 1163.18 1199.55 1245.54 1246.03 1254.48 1368.30 1372.50 1435.41 1474.10 1481.79 1487.47 1584.45 1792.78 2370.85 3078.12 3148.28 3159.98 3179.32 3205.25 3260.36 3288.84 3836.89
formula: C4H9O2
InChI: InChI=1S/C2H4O2.C2H5/c1-2(3)4;1-2/h3H,1H3;1H2,2H3
15 atoms
C  -2.479947 -0.782329 0.10311
H  -3.061763 -0.883869 -0.815936
H  -3.144674 -0.409218 0.885613
H  -2.082845 -1.750925 0.392387
C  -1.358156 0.18895 -0.113775
O  -1.672495 1.431089 -0.468033
H  -2.62614 1.552562 -0.54259
O  -0.178597 -0.087389 0.01359
C  2.156675 0.792049 -0.115781
H  1.823786 1.494825 0.64045
H  1.906168 1.016108 -1.14711
C  2.787685 -0.389686 0.229822
H  1.607944 -0.606366 0.233555
H  3.119737 -0.542147 1.251333
H  3.202619 -1.023656 -0.546636
totalener: -308.19870690 hartree
nucrepener: 236.65725596 hartree
electener: -544.85596286 hartree
oneelecener: -877.81689138 hartree
twoeener: 332.96092852 hartree
kineticenergy: 306.88372671 hartree
exchangeener: -27.091162770509 hartree
correlationener: -1.980871931844 hartree
xcener: -29.072034702353 hartree
temp: 298.15 k
press: 1.00 atm
thermalcorrenthalpy: 0.00094421 hartree
totalenthalpy: -308.08169961 hartree
totalentropycorr: -0.04069369 hartree
gibbsenthalpy: -308.12239329 hartree
gibbsminuselec: 0.09247833 hartree
chargesum: 1.0000000
charge: -0.254471 0.133188 0.132407 0.122273 0.377105 -0.220181 0.245364 -0.426924 0.094524 0.194944 0.195053 -0.176680 0.233862 0.174774 0.174762
charge: 0.037824 0.037696 0.037444 0.035885 -0.394018 0.402360 -0.075403 0.093303 0.331562 0.053971 0.053983 0.134009 0.148456 0.051466 0.051463
qa: -0.2545 0.1332 0.1324 0.1223 0.3771 -0.2202 0.2454 -0.4269 0.0945 0.1949 0.1951 -0.1767 0.2339 0.1748 0.1748
va: 3.8671 0.9983 0.9985 1.0142 4.1317 2.2556 1.0025 2.0496 3.5933 0.9824 0.9824 3.8613 1.0094 1.0001 1.0001
dispcorr: -0.015812360 hartree
energy: -308.215482642153
dipole: 2.15256 -0.74743 1.40513 -2.77699 2.72391 -0.05308 0.86224 -0.78075 0.08150
quadrupole: 728.74691 -725.19325 -0.04355 .25949 .96476 124.96859 -147.66318 0.04968 0.96505 -0.25733 27.48209 -51.52517 -0.99 0.03 -0.05 -5.93883 4.99351 7 6 4 33.63738 -32.12872 8 7 9 -29.50409 29.04735 1 3 2
magnitude: 1.40849 au
magnitude: 3.58011 debye
zeropoint: 0.12437497 hartree
thermalvibcorrection: 0.00584782 hartree
thermalrotcorrection: 0.00141627 hartree
thermaltrasncorrection: 0.00141627 hartree
thermaltotal: -308.08242732 hartree
thermalcorr: 0.00868036 hartree
nonthermalcorr: 0.12437497 hartree
totalcorr: 0.13305533 hartree
totalenthalpy: -308.08148311 hartree
