program: Orca
programVersion: 4.2.1
elementType: Rh P P O C N C H C C H C H C C H H C C H H H C H H H C H H H C C H H H C H H H C H H H C C H H H C H H H C H H H C C H H H C H H H C H H H C H C C C C C C H H H H H H
elementType: Rh
charge: 0
multiplicity: 1
keywords: RKS wB97M-V def2-TZVPP def2-tzvpp/c def2/j tightscf rijcosx GRID6
keywords: CPCM
formula: C30H48NOP2Rh
InChI: InChI=1S/C23H42NP2.C6H5.CO.Rh.H/c1-20(2,3)25(21(4,5)6)16-18-14-13-15-19(24-18)17-26(22(7,8)9)23(10,11)12;1-2-4-6-5-3-1;1-2;;/h13-16H,17H2,1-12H3;1-5H;;;/q-1;;;+1;
83 atoms
Rh 0.025336 0.069032 -0.239313
P  2.318213 -0.416423 0.214698
P  -2.312133 -0.214266 0.006972
O  0.015575 0.116625 -3.338375
C  -0.272406 -4.880472 -0.19226
N  -0.109809 -2.118443 -0.257175
C  2.190432 -2.154556 0.451297
H  3.078899 -2.749375 0.685012
C  1.018219 -2.832671 0.110144
C  0.909255 -4.262818 0.129538
H  1.789266 -4.845291 0.410024
C  -1.40676 -4.115414 -0.534916
H  -2.364981 -4.580186 -0.770436
C  -1.273236 -2.734433 -0.547572
C  -2.444375 -1.843431 -0.8579
H  -3.396381 -2.357437 -0.649313
H  -2.456693 -1.605575 -1.937212
C  3.506992 -0.130083 -1.265874
C  3.304177 1.268395 -1.841159
H  2.289369 1.406216 -2.236822
H  4.001758 1.436005 -2.678223
H  3.476415 2.069243 -1.108851
C  3.130967 -1.176138 -2.316222
H  3.47176 -2.18066 -2.030019
H  3.603469 -0.922662 -3.279015
H  2.049895 -1.249982 -2.494085
C  4.981107 -0.337806 -0.929704
H  5.393296 0.441329 -0.274626
H  5.568991 -0.307207 -1.862246
H  5.171618 -1.318442 -0.469424
C  3.10484 0.301827 1.79672
C  2.059648 0.247776 2.909724
H  1.254762 0.977579 2.75963
H  2.541296 0.484367 3.872126
H  1.607206 -0.751939 3.001706
C  4.285297 -0.553642 2.262417
H  3.978459 -1.590303 2.463465
H  4.670991 -0.145636 3.210724
H  5.127957 -0.575996 1.563523
C  3.536896 1.750542 1.588232
H  4.396662 1.84817 0.910756
H  3.843486 2.189826 2.551621
H  2.720131 2.375145 1.194647
C  -3.543938 0.897096 -0.916561
C  -4.855185 0.190155 -1.260532
H  -4.699047 -0.702157 -1.88382
H  -5.484328 0.875781 -1.850413
H  -5.445736 -0.10565 -0.386698
C  -2.875904 1.306672 -2.228255
H  -1.960678 1.891247 -2.061834
H  -3.569101 1.940246 -2.80329
H  -2.630591 0.446159 -2.867434
C  -3.807954 2.159929 -0.099165
H  -4.38365 1.966107 0.816378
H  -4.398459 2.867477 -0.702285
H  -2.875098 2.674897 0.17935
C  -2.907339 -0.570212 1.77771
C  -4.413176 -0.81245 1.847533
H  -5.00349 0.094326 1.659636
H  -4.67317 -1.153124 2.862394
H  -4.751531 -1.597891 1.155501
C  -2.522381 0.58277 2.702772
H  -1.433507 0.632282 2.839438
H  -2.964593 0.41259 3.697042
H  -2.864485 1.567295 2.357092
C  -2.196121 -1.829247 2.277257
H  -2.525429 -2.740428 1.758204
H  -2.430735 -1.965112 3.344698
H  -1.101991 -1.759545 2.189823
C  0.040928 0.139112 -2.185564
H  -0.33813 -5.972002 -0.172951
C  0.085478 2.139665 -0.017051
C  0.272054 3.006766 -1.11293
C  -0.100116 2.768476 1.23013
C  0.285471 4.397002 -0.97542
C  -0.090189 4.157448 1.378244
C  0.106188 4.986047 0.274752
H  0.410271 2.602362 -2.120979
H  -0.264938 2.16517 2.1246
H  0.436666 5.021996 -1.860752
H  -0.238157 4.592131 2.371612
H  0.116725 6.07317 0.386375
H  0.015063 -0.022345 1.354348
elementType: Rh P O C N H
totalener: -2095.28247230 hartree
nucrepener: 5205.83150486 hartree
electener: -7301.11397717 hartree
twoeener: 5971.29748482 hartree
cpcmener: -0.01041283 hartree
kineticenergy: 2018.89172761 hartree
exchangeener: -170.584123179216 hartree
correlationener: -9.337875011741 hartree
xcener: -178.905494683417 hartree
chargesum: -0.0000000
charge: -0.598643 0.534524 0.372346 -0.103242 -0.113858 -0.121033 -0.515367 0.096126 0.213314 -0.214718 0.120415 -0.262364 0.121873 0.113573 -0.284258 0.154476 0.180288 0.034935 -0.387076 0.129414 0.131418 0.141500 -0.380910 0.135412 0.129272 0.128455 -0.436067 0.128351 0.130374 0.135407 0.073428 -0.421741 0.133201 0.130010 0.152549 -0.394155 0.134022 0.122104 0.135278 -0.426336 0.127353 0.126103 0.153030 0.057369 -0.363553 0.130264 0.129558 0.137183 -0.431414 0.144904 0.137424 0.143387 -0.417827 0.130348 0.130973 0.159285 0.060253 -0.416182 0.130969 0.134683 0.137680 -0.395484 0.135909 0.137227 0.143647 -0.409229 0.137896 0.135335 0.156461 0.088763 0.135085 0.284737 -0.255310 -0.267346 -0.178626 -0.157605 -0.163952 0.158332 0.150546 0.134509 0.135353 0.134022 -0.134356
charge: -0.477619 0.907248 0.959501 0.258421 -0.021816 0.216199 -0.282415 -0.018541 -0.200249 -0.036170 0.021302 -0.079822 0.014046 -0.186580 -0.128860 0.025821 0.032703 -0.280404 -0.007008 0.020069 0.019602 0.019151 -0.006229 0.020360 0.020390 0.019865 -0.014538 0.012069 0.022014 0.017927 -0.278203 -0.015087 0.014257 0.018323 0.019946 -0.008288 0.019113 0.019468 0.010683 -0.008646 0.011215 0.021404 0.025807 -0.284599 -0.003219 0.019628 0.024727 0.014079 -0.003692 0.027753 0.024656 0.017382 -0.003280 0.013284 0.024506 0.029225 -0.282990 -0.009194 0.014235 0.025076 0.017422 -0.003692 0.018473 0.023100 0.018056 0.004323 0.022121 0.023485 0.025162 -0.197134 0.028780 -0.136548 -0.068512 -0.066174 -0.038368 -0.040024 -0.048132 0.018730 0.012531 0.021135 0.020800 0.018194 -0.037737
qa: -0.5986 0.5345 0.3723 -0.1032 -0.1139 -0.1210 -0.5154 0.0961 0.2133 -0.2147 0.1204 -0.2624 0.1219 0.1136 -0.2843 0.1545 0.1803 0.0349 -0.3871 0.1294 0.1314 0.1415 -0.3809 0.1354 0.1293 0.1285 -0.4361 0.1284 0.1304 0.1354 0.0734 -0.4217 0.1332 0.1300 0.1525 -0.3942 0.1340 0.1221 0.1353 -0.4263 0.1274 0.1261 0.1530 0.0574 -0.3636 0.1303 0.1296 0.1372 -0.4314 0.1449 0.1374 0.1434 -0.4178 0.1303 0.1310 0.1593 0.0603 -0.4162 0.1310 0.1347 0.1377 -0.3955 0.1359 0.1372 0.1436 -0.4092 0.1379 0.1353 0.1565 0.0888 0.1351 0.2847 -0.2553 -0.2673 -0.1786 -0.1576 -0.1640 0.1583 0.1505 0.1345 0.1354 0.1340 -0.1344
va: 5.4219 4.0354 3.8567 2.3702 3.9579 3.0405 3.6951 1.0036 3.9414 3.9046 1.0034 3.8715 1.0051 3.8438 3.7656 0.9879 0.9715 3.7917 3.8225 0.9742 0.9938 0.9761 3.8051 0.9918 0.9910 0.9908 3.8102 0.9841 0.9959 0.9774 3.8095 3.7831 0.9633 0.9961 0.9880 3.8023 0.9886 0.9931 0.9822 3.8107 0.9844 0.9963 0.9727 3.8119 3.7885 0.9846 0.9933 0.9838 3.8072 0.9633 1.0003 0.9847 3.8074 0.9816 0.9976 0.9736 3.8719 3.8036 0.9833 0.9974 0.9781 3.7924 0.9783 0.9948 0.9802 3.7871 0.9836 0.9928 0.9829 3.2574 0.9890 2.9851 3.8195 3.8472 3.9588 3.9704 3.9356 0.9635 0.9672 0.9899 0.9896 0.9905 0.9970
energy: -2095.282472301883
dipole: -2.76062 1.11830 -1.64231 3.16123 -3.29745 -0.13622 28.94341 -28.83193 0.11148
magnitude: 1.65172 au
magnitude: 4.19834 debye
