program: Orca
programVersion: 4.2.1
elementType: Rh P P C N C H C C H C H C C H H C C H H H C H H H C H H H C C H H H C H H H C H H H C C H H H C H H H C H H H C C H H H C H H H C H H H H H C C C C C C H H H H H
elementType: Rh
charge: 0
multiplicity: 1
keywords: RKS wB97M-V def2-TZVPP def2-tzvpp/c def2/j tightscf rijcosx GRID6
keywords: CPCM
formula: C29H48NP2Rh
InChI: InChI=1S/C23H43NP2.C6H5.Rh/c1-20(2,3)25(21(4,5)6)16-18-14-13-15-19(24-18)17-26(22(7,8)9)23(10,11)12;1-2-4-6-5-3-1;/h13-15H,16-17H2,1-12H3;1-5H;/q-1;;+1
81 atoms
Rh -0.000041 0.077209 0.000007
P  2.275888 -0.242836 0.095568
P  -2.276062 -0.24214 -0.095688
C  -0.000904 -4.87938 0.000657
N  -0.000375 -2.082074 0.000157
C  2.311491 -1.976055 0.765244
H  3.246264 -2.518981 0.547035
C  1.11769 -2.773637 0.34491
C  1.144979 -4.167615 0.342962
H  2.064904 -4.684566 0.624243
C  -1.146509 -4.167309 -0.341942
H  -2.066622 -4.684017 -0.623054
C  -1.118685 -2.773346 -0.344406
C  -2.312133 -1.975443 -0.76512
H  -3.247143 -2.518021 -0.54706
H  -2.280315 -1.865999 -1.863338
C  3.17027 -0.422288 -1.575093
C  2.904786 0.836962 -2.397134
H  1.829928 0.948663 -2.598715
H  3.421411 0.768162 -3.368584
H  3.245757 1.76017 -1.908312
C  2.505514 -1.597747 -2.294623
H  2.748547 -2.570566 -1.841241
H  2.856667 -1.63693 -3.338503
H  1.4086 -1.492711 -2.318627
C  4.667582 -0.685002 -1.477302
H  5.227146 0.183122 -1.101764
H  5.069726 -0.908547 -2.479608
H  4.90775 -1.550194 -0.8404
C  3.366394 0.675001 1.350989
C  2.479417 0.874933 2.581767
H  1.57919 1.456358 2.343084
H  3.039774 1.418861 3.35962
H  2.150325 -0.076203 3.028841
C  4.625201 -0.074731 1.782765
H  4.403876 -1.062414 2.213734
H  5.13642 0.500111 2.572722
H  5.35421 -0.215146 0.976017
C  3.734828 2.045421 0.786843
H  4.451135 1.980845 -0.045082
H  4.212337 2.655134 1.570972
H  2.851462 2.602574 0.437776
C  -3.36597 0.675923 -1.351445
C  -4.624936 -0.073379 -1.783479
H  -4.403862 -1.061131 -2.214419
H  -5.135814 0.501648 -2.573523
H  -5.354143 -0.21356 -0.976869
C  -2.478602 0.875479 -2.5820
H  -1.578287 1.456691 -2.343125
H  -3.038594 1.419452 -3.360085
H  -2.149626 -0.075808 -3.028841
C  -3.734012 2.046482 -0.787408
H  -4.450821 1.98221 0.044106
H  -4.210722 2.656559 -1.571738
H  -2.85052 2.603047 -0.43775
C  -3.170895 -0.421012 1.574788
C  -4.668283 -0.683177 1.47668
H  -5.227436 0.185102 1.100883
H  -5.070746 -0.906421 2.478924
H  -4.908616 -1.548375 0.83985
C  -2.905148 0.838254 2.396714
H  -1.830303 0.949594 2.598561
H  -3.422042 0.769782 3.368043
H  -3.245666 1.761518 1.907684
C  -2.506757 -1.596627 2.294631
H  -2.750158 -2.569414 1.841381
H  -2.858081 -1.635473 3.338465
H  -1.4098 -1.492078 2.318787
H  -0.001111 -5.971359 0.000867
H  2.279983 -1.866442 1.863451
C  0.000379 2.124014 0.000058
C  0.208932 2.88852 -1.172612
C  -0.207768 2.888324 1.17293
C  0.210285 4.285575 -1.179503
C  -0.207762 4.285378 1.180298
C  0.001653 5.000789 0.000526
H  0.380211 2.379002 -2.126914
H  -0.379511 2.378641 2.12706
H  0.377558 4.821111 -2.120203
H  -0.374584 4.820758 2.121167
H  0.002217 6.094178 0.000717
elementType: Rh P C N H
totalener: -1981.93264814 hartree
nucrepener: 4726.64830872 hartree
electener: -6708.58095685 hartree
twoeener: 5454.57725727 hartree
cpcmener: -0.01164464 hartree
kineticenergy: 1906.35304784 hartree
exchangeener: -161.053098890384 hartree
correlationener: -8.826242712121 hartree
xcener: -168.908327530031 hartree
chargesum: 0.0000000
charge: -0.188230 0.266606 0.266550 -0.127557 -0.268184 -0.362813 0.150738 0.156912 -0.153740 0.135253 -0.152955 0.135225 0.156052 -0.362471 0.150453 0.168853 0.081593 -0.400472 0.134091 0.129734 0.137963 -0.418877 0.124768 0.131212 0.152567 -0.410560 0.126010 0.129117 0.126703 -0.002894 -0.370738 0.138620 0.126683 0.123151 -0.364862 0.119241 0.125872 0.129162 -0.424104 0.123614 0.124815 0.157104 -0.003871 -0.365045 0.119002 0.125889 0.129672 -0.370516 0.138512 0.126458 0.122999 -0.424265 0.124039 0.124944 0.157272 0.082604 -0.410707 0.125918 0.129021 0.127132 -0.401350 0.133999 0.130286 0.138168 -0.419468 0.124923 0.131515 0.152482 0.148542 0.168901 -0.117902 -0.216895 -0.214955 -0.165886 -0.166594 -0.184265 0.151315 0.150629 0.125402 0.125649 0.126241
charge: -0.629615 0.897851 0.897867 0.009354 0.246549 -0.134219 0.020601 -0.147780 -0.016377 0.031549 -0.016379 0.031550 -0.147769 -0.134250 0.020560 0.031659 -0.288806 -0.007064 0.023946 0.017666 0.018523 -0.005063 0.018205 0.020503 0.025415 -0.015500 0.014284 0.021166 0.014683 -0.287818 -0.006913 0.027069 0.018164 0.014836 -0.010326 0.015873 0.021272 0.012793 -0.007369 0.011501 0.020765 0.030770 -0.287845 -0.010305 0.015851 0.021287 0.012724 -0.006929 0.027070 0.018144 0.014840 -0.007363 0.011606 0.020710 0.030816 -0.288775 -0.015546 0.014222 0.021151 0.014745 -0.007054 0.023991 0.017650 0.018666 -0.005087 0.018181 0.020553 0.025401 0.033441 0.031699 -0.182647 -0.082998 -0.083052 -0.055562 -0.055825 -0.069131 0.011446 0.011591 0.015460 0.015463 0.011684
qa: -0.1882 0.2666 0.2665 -0.1276 -0.2682 -0.3628 0.1507 0.1569 -0.1537 0.1353 -0.1530 0.1352 0.1561 -0.3625 0.1505 0.1689 0.0816 -0.4005 0.1341 0.1297 0.1380 -0.4189 0.1248 0.1312 0.1526 -0.4106 0.1260 0.1291 0.1267 -0.0029 -0.3707 0.1386 0.1267 0.1232 -0.3649 0.1192 0.1259 0.1292 -0.4241 0.1236 0.1248 0.1571 -0.0039 -0.3650 0.1190 0.1259 0.1297 -0.3705 0.1385 0.1265 0.1230 -0.4243 0.1240 0.1249 0.1573 0.0826 -0.4107 0.1259 0.1290 0.1271 -0.4013 0.1340 0.1303 0.1382 -0.4195 0.1249 0.1315 0.1525 0.1485 0.1689 -0.1179 -0.2169 -0.2150 -0.1659 -0.1666 -0.1843 0.1513 0.1506 0.1254 0.1256 0.1262
va: 3.1373 3.7790 3.7803 3.9641 3.0436 3.8730 0.9846 3.7258 3.9283 0.9987 3.9276 0.9986 3.7287 3.8757 0.9843 0.9792 3.7816 3.8134 0.9826 0.9942 0.9829 3.7809 0.9822 0.9943 0.9905 3.7939 0.9853 0.9977 0.9809 3.8713 3.7905 0.9900 0.9941 0.9909 3.7806 0.9891 0.9937 0.9851 3.8118 0.9828 0.9969 0.9772 3.8729 3.7802 0.9893 0.9937 0.9852 3.7909 0.9901 0.9942 0.9911 3.8116 0.9828 0.9968 0.9771 3.7794 3.7935 0.9854 0.9978 0.9805 3.8137 0.9826 0.9937 0.9826 3.7803 0.9819 0.9943 0.9900 0.9892 0.9792 3.2103 3.8019 3.7982 3.9387 3.9364 3.9093 0.9677 0.9678 0.9914 0.9915 0.9929
energy: -1981.932648136496
dipole: 0.00358 -0.00625 -0.00267 0.76169 -4.22276 -3.46107 -0.00374 0.00568 0.00194
magnitude: 3.46108 au
magnitude: 8.79736 debye
