program: Gaussian 16
title: Title Card Required
version: ES64L-G16RevC.01
frameworkgroup: C1[X(C15H25)]
method: RmPW1PW91
basis: 6-31+G(d,p)
operation: Freq
keyword: #N
keyword: Geom=AllCheck
keyword: Guess=TCheck
keyword: SCRF=Check
keyword: GenChk
keyword: RmPW1PW91/6-31+G(d,p)
keyword: Freq
converged: YES YES NO YES
title: Mulliken charges:
elementType: C C C H C C H H H C C H H C H H H C C H C H H C H H H H H H H C C H H C H H H H
charge: -0.043307 -0.033865 0.356734 0.178875 -0.417459 -0.668633 0.190774 0.177875 0.153694 0.116212 -0.433893 0.196034 0.190149 -0.629075 0.192496 0.121519 0.189674 0.047623 -0.424913 0.175665 -0.578256 0.245424 0.219302 -0.382000 0.182028 0.156355 0.185916 0.180816 0.185272 0.175537 0.202451 0.301243 -0.626394 0.246000 0.223163 -0.561550 0.277265 0.252177 0.221319 0.257750
chargesum: 1.00000
title: Mulliken charges with hydrogens summed into heavy atoms:
elementType: C C C C C C C C C C C C C C C
charge: 0.317596 -0.033865 0.513090 -0.417459 -0.146289 0.301484 -0.047710 -0.125386 0.293048 -0.029946 -0.211524 -0.004012 0.301243 0.100520 0.189211
1716.lowfreq: -9.4770 -0.0003 0.0007 0.0008 5.1090 7.5523 57.5708 64.9305 71.6645
frequency: 57.5279 64.9259 71.6458 93.8908 121.0030 131.4530 183.1542 195.7177 218.2762 229.8503 235.5044 243.5653 265.9756 279.4175 311.9829 324.1706 346.6979 374.5459 398.0301 432.4390 492.6131 514.7926 527.7350 566.7007 584.1734 648.9835 653.3903 713.7871 746.2922 787.0154 810.8044 822.6606 845.1178 902.7299 905.0462 916.6088 930.0937 952.4566 969.7145 985.0053 997.5347 1013.5325 1020.8643 1026.7753 1034.7379 1076.2968 1089.8497 1102.0803 1114.9598 1125.1883 1134.0156 1152.8198 1174.5686 1179.1128 1207.8716 1222.3666 1244.2916 1258.0481 1272.4252 1287.5931 1308.1057 1315.6250 1320.2243 1335.1412 1342.6028 1344.4183 1364.2420 1369.2204 1376.1271 1384.6205 1391.9316 1409.2287 1414.5282 1418.8087 1421.5695 1424.0337 1459.1936 1481.2587 1488.5717 1490.9088 1498.7339 1503.3686 1504.0671 1505.3760 1507.5550 1510.3458 1512.5844 1515.0612 1729.7015 2917.2189 2980.4953 2983.5811 3038.4395 3042.8748 3045.3331 3060.4154 3063.0496 3066.5053 3075.2647 3075.7192 3086.7551 3100.8272 3106.1167 3106.2922 3108.7990 3125.9287 3133.9162 3141.7459 3151.5464 3153.4787 3161.4869 3163.2153 3206.9640 3212.9128
redmass: 2.9654 2.8323 2.5843 3.1262 2.0252 1.1947 2.4486 1.7046 1.1714 1.3134 1.5026 1.7725 1.7393 2.2726 3.0353 3.0177 2.0827 2.1840 2.3635 2.1845 2.8842 2.8287 2.6849 2.6967 3.0433 2.4838 2.1813 2.7100 3.1097 1.3336 2.2558 1.9003 1.7314 1.8807 2.1494 2.0009 1.8005 1.9765 1.3370 1.6106 1.4088 1.9505 2.0953 1.5546 1.7172 1.8647 1.6509 1.8998 1.9983 2.1432 2.0962 2.1108 1.7323 1.7739 1.5249 1.4974 1.3119 1.2789 1.4105 1.3109 1.7662 1.4968 1.2222 1.3644 1.2975 1.6076 1.2587 1.5451 1.4507 1.6159 1.4265 1.8185 1.4990 1.1165 1.3666 1.3088 1.2020 1.1107 1.0907 1.0965 1.1136 1.2109 1.1032 1.1399 1.0902 1.0942 1.0773 1.1870 8.6432 1.0757 1.0700 1.0674 1.0483 1.0697 1.0794 1.0416 1.0396 1.0604 1.0687 1.0728 1.0684 1.1006 1.0878 1.0912 1.0626 1.0989 1.0971 1.1020 1.1027 1.1020 1.1048 1.1022 1.1018 1.1017
irintensity: 0.7318 0.6718 0.3602 4.6967 0.3954 3.8256 7.1803 0.6256 4.6661 1.0003 5.3835 1.7645 3.2405 0.3717 0.8341 2.2294 0.1561 0.5479 0.7358 2.1477 6.6023 2.0729 1.8394 3.5793 0.6708 2.3457 4.3207 0.1255 17.2079 13.6163 0.3748 2.0903 1.9112 14.9140 11.3611 10.8119 3.8343 29.0671 0.2317 7.1619 3.4487 7.9562 11.1382 1.4871 1.3895 0.7650 5.5866 8.7020 19.6342 2.0569 8.5963 3.7834 28.4580 6.7981 3.1646 3.3373 16.8778 17.4455 2.2135 6.8905 28.1181 4.7855 11.4877 44.9979 12.3875 4.9212 80.3401 6.2819 4.9841 4.3973 17.8464 3.9347 14.1602 4.6062 26.7676 5.3896 14.2130 7.0246 1.6209 13.3920 15.3330 28.4654 6.4433 22.4103 0.5096 2.8523 11.0725 3.8137 12.4597 27.8096 54.6478 120.1131 24.7499 17.8912 12.3141 30.2660 10.0431 17.8275 18.7882 9.8355 16.3265 7.8357 9.5570 18.6164 12.1465 12.3405 40.2102 26.9244 8.8541 22.2249 9.6409 9.8935 4.9996 4.6079
temp: 298.150 k
press: 1.00000 atm
elementType: 6 6 6 1 6 6 1 1 1 6 6 1 1 6 1 1 1 6 6 1 6 1 1 6 1 1 1 1 1 1 1 6 6 1 1 6 1 1 1 1
symmnumber: 1
zpe: 966262.4 jmol-1
zpe.correction: 0.368030 hartree
zpe.thermalcorrener: 0.384344 hartree
zpe.thermalcorrenthalpy: 0.385288 hartree
zpe.thermalcorrgfe: 0.325652 hartree
zpe.sumelectzpe: -585.917347 hartree
zpe.sumelectthermal: -585.901034 hartree
zpe.sumelectthermalent: -585.900090 hartree
zpe.sumelectthermalfe: -585.959725 hartree
dipole: 6.4822 3.3716 -1.2010
dipole: 7.4047
quadrupole: -63.9942 -76.3831 -81.9765
quadrupole: 7.5893 -2.2271 -3.5226
quadrupole: 10.1237 -2.2652 -7.8585 7.5893 -2.2271 -3.5226
hfenergy: -586.2853774 hartree
pointgroup: C01 [X(C15H25)]
dipole: 0.5258287 -0.9934312 -2.6876524 debye
polarizability: 151.4783311|-10.5852975|168.0741913|-6.1095115|5.2742541|171.9540951 unknown
InChI: InChI=1S/C15H25/c1-10(2)13-7-5-11(3)14-8-6-12(4)15(14)9-13/h11-13H,5-9H2,1-4H3
charge 1 multiplicity 1
40 atoms
C  -2.16908068 -0.42630905 2.03137772
C  -0.93883779 -0.54602553 1.16188928
C  -1.88083967 1.57492994 0.63596859
H  -2.97111975 -1.07485066 1.6524542
C  -0.80149456 0.53697926 0.37433171
C  -1.37338526 3.01156181 0.75480148
H  -2.19715963 3.68313222 1.01030307
H  -0.6193612 3.0941705 1.54337241
H  -0.93464637 3.38299256 -0.17620086
C  -0.03358324 -1.74467834 1.27458441
C  1.38337967 -1.47965948 0.75380512
H  2.04709195 -2.26612241 1.13158043
H  1.74807173 -0.54626203 1.19230517
C  -0.66298671 -3.02481325 0.70837868
H  -1.61356376 -3.24550655 1.1985186
H  -0.8677286 -2.95069088 -0.3653567
H  -0.00441609 -3.88438803 0.86126799
C  0.66814113 -0.43220347 -1.52168003
C  0.2393424 0.78302722 -0.69043147
H  -0.12958475 1.56079275 -1.36941492
C  -2.54079481 1.0601751 1.93134109
H  1.32096695 -0.05546452 -2.34179256
H  1.14581243 1.21521462 -0.25142615
C  1.59187741 -1.45745069 -0.75949483
H  -1.98191219 -0.74723555 3.06136324
H  -2.61090697 1.55043879 -0.19170724
H  -2.10774356 1.59799693 2.78075143
H  -3.61784796 1.23779573 1.95353033
H  0.08117058 -1.91834231 2.35338588
H  1.45355423 -2.46181528 -1.16427228
H  2.6308343 -1.18618211 -0.95751486
C  -0.35037256 -1.06500834 -2.36146329
C  -0.00050362 -2.1852967 -3.24567218
H  -0.4007545 -1.99321393 -4.24824124
H  1.06147861 -2.41600425 -3.29322847
C  -1.72282292 -0.57951622 -2.37705599
H  -2.08568882 -0.64228941 -1.33512497
H  -1.73652129 0.50244223 -2.56889809
H  -2.37991814 -1.10063186 -3.07023103
H  -0.54954103 -3.0745584 -2.89884232
