program: Gaussian 16
title: Title Card Required
version: ES64L-G16RevC.01
frameworkgroup: C1[X(C15H25)]
method: RmPW1PW91
basis: 6-31+G(d,p)
operation: Freq
keyword: #N
keyword: Geom=AllCheck
keyword: Guess=TCheck
keyword: SCRF=Check
keyword: GenChk
keyword: RmPW1PW91/6-31+G(d,p)
keyword: Freq
converged: YES YES NO YES
title: Mulliken charges:
elementType: C C C H C C H H H C C H H C H H H C C H C H H C H H H H H H H H C C H H C H H H
charge: -0.108458 -1.325581 0.099833 0.200865 1.112723 -0.669385 0.198275 0.176912 0.176335 0.134666 -0.315848 0.190485 0.172101 -0.576560 0.182346 0.163145 0.201196 -0.009701 -0.392674 0.194313 -0.438888 0.197512 0.212834 -0.453080 0.225496 0.182569 0.197526 0.192073 0.209639 0.123099 0.167197 0.194901 0.340734 -0.504557 0.202565 0.198773 -0.672958 0.193840 0.227820 0.197916
chargesum: 1.00000
title: Mulliken charges with hydrogens summed into heavy atoms:
elementType: C C C C C C C C C C C C C C C
charge: 0.317903 -1.325581 0.282402 1.235822 -0.117864 0.344306 0.046737 -0.029872 0.187811 0.014473 -0.049289 -0.090982 0.340734 -0.103219 -0.053381
1716.lowfreq: -936.5642 -7.1953 -2.7200 -0.0007 -0.0005 0.0004 8.5322 70.2393 81.7114
frequency: -936.5641 70.2369 81.7025 90.7223 133.4875 152.4359 162.3343 164.2949 192.7517 232.9912 245.2751 277.9782 295.9410 301.9382 343.2206 363.9637 376.1867 393.0113 410.6815 456.3581 500.2886 530.8709 551.8040 565.7029 616.9471 632.2429 704.6229 733.4853 762.2555 783.6367 807.1136 834.4951 858.1895 883.2775 904.4694 911.4253 937.7694 956.3318 959.8626 970.5761 991.4678 1004.9713 1015.4599 1018.6688 1030.6442 1051.2697 1067.7990 1075.6822 1098.7674 1117.8438 1119.9642 1132.1818 1147.7229 1168.6454 1191.2793 1203.8147 1214.5115 1237.1543 1254.9788 1264.2200 1279.9248 1288.9966 1300.7640 1317.6654 1338.6237 1341.7506 1353.0732 1364.6878 1371.1537 1387.2989 1403.7128 1406.8822 1408.4210 1421.8770 1425.4482 1430.7307 1435.9341 1451.6265 1475.1983 1482.0865 1490.3989 1499.0721 1501.6873 1505.2867 1507.1152 1512.0035 1514.1817 1522.7374 1604.8206 1637.4313 3016.7237 3043.8166 3057.5838 3069.6955 3080.7906 3088.2277 3089.7577 3094.5222 3096.1101 3105.1088 3113.1127 3128.5749 3132.5375 3138.6254 3139.5955 3150.7669 3160.2036 3161.4982 3163.6278 3170.8619 3176.6349 3182.7266 3184.4365 3265.2923
redmass: 1.2474 2.9715 2.8748 2.8947 2.3310 1.4918 1.5258 1.1579 2.3173 2.4908 1.1518 2.2034 2.5221 2.7105 2.5929 2.7322 2.6462 2.3381 2.2118 2.2169 2.6465 2.9601 2.6963 2.4226 2.4356 2.4046 1.6990 2.3505 1.9886 1.5893 2.3080 2.3669 2.1634 2.2296 1.7375 2.0421 1.6100 1.4917 1.6368 2.0888 1.9954 1.6638 1.8122 1.5012 1.6423 1.6456 1.7160 1.9184 1.8393 2.2244 1.9899 2.0533 1.3662 1.4815 1.5234 1.3800 1.3899 1.3050 1.3801 1.3609 1.2934 1.3582 1.4757 1.6421 1.7487 1.1021 1.4088 1.4495 1.4824 1.4071 1.3849 1.6442 1.4483 1.5146 1.2702 1.4355 1.2271 1.0871 1.0967 1.0964 1.0945 1.0587 1.0738 1.0676 1.0589 1.0710 1.0864 1.0720 5.3948 3.4442 1.0809 1.0718 1.0437 1.0380 1.0811 1.0576 1.0447 1.0624 1.0699 1.0715 1.0798 1.1003 1.0911 1.0912 1.1004 1.1021 1.1011 1.1023 1.1016 1.1016 1.0586 1.1023 1.1042 1.1149
irintensity: 3192.8825 0.2334 0.1853 0.4982 0.1914 0.2843 2.1554 0.9500 0.0713 0.6844 0.2812 0.3589 2.9800 0.1789 1.2963 9.1469 43.9643 3.2316 0.0805 0.4959 19.5872 12.4253 3.5196 12.5529 5.7393 14.8881 95.1331 12.1070 11.3172 35.3949 0.2126 17.5632 8.8254 7.4243 3.9700 11.4165 0.3101 1.3153 2.4878 10.9458 2.5616 2.3964 12.8623 3.6908 1.1594 4.9866 0.8602 1.3480 1.3272 16.9256 3.5259 3.5366 28.4294 37.5363 26.9240 6.7382 6.8802 3.9168 0.3409 7.2189 4.5848 16.9203 0.3399 5.0858 11.1369 22.8127 2.9372 3.3047 0.3033 2.0241 3.7621 4.0607 28.5324 13.4687 11.4137 9.2286 2.7819 19.8203 14.1502 11.0275 20.3392 10.6392 22.4329 3.2722 3.9407 5.6310 2.5901 32.3473 24.7120 24.3861 6.2422 3.8303 1.7088 11.7471 5.4052 17.5148 3.3629 13.4865 17.8554 2.6150 7.1306 12.4841 7.8751 1.7433 18.2245 16.5366 1.0382 3.7071 16.8103 12.3927 2.3697 9.5989 5.0405 0.7075
temp: 298.150 k
press: 1.00000 atm
elementType: 6 6 6 1 6 6 1 1 1 6 6 1 1 6 1 1 1 6 6 1 6 1 1 6 1 1 1 1 1 1 1 1 6 6 1 1 6 1 1 1
symmnumber: 1
zpe: 960298.4 jmol-1
zpe.correction: 0.365758 hartree
zpe.thermalcorrener: 0.380960 hartree
zpe.thermalcorrenthalpy: 0.381904 hartree
zpe.thermalcorrgfe: 0.325149 hartree
zpe.sumelectzpe: -585.908925 hartree
zpe.sumelectthermal: -585.893724 hartree
zpe.sumelectthermalent: -585.892780 hartree
zpe.sumelectthermalfe: -585.949534 hartree
dipole: -0.7929 0.2075 0.3563
dipole: 0.8937
quadrupole: -70.6255 -74.0340 -83.8400
quadrupole: -4.9513 0.7443 1.2471
quadrupole: 5.5410 2.1325 -7.6735 -4.9513 0.7443 1.2471
hfenergy: -586.2746834 hartree
pointgroup: C01 [X(C15H25)]
dipole: -0.307645 0.0822545 -0.1490871 debye
polarizability: 196.3239756|2.7842449|161.0670044|1.691298|-0.3996192|141.4193819 unknown
InChI: InChI=1S/C15H25/c1-10(2)13-7-5-11(3)14-8-6-12(4)15(14)9-13/h11-13,15H,1,5-9H2,2-4H3
charge 1 multiplicity 1
40 atoms
C  2.39610882 -0.67609076 -0.61198996
C  1.29953543 0.09419284 0.05658393
C  0.62091028 -2.20198809 0.05087954
H  2.83678155 -0.16027381 -1.46825717
C  0.22996917 -0.74855207 0.3312157
C  1.03015536 -2.92177686 1.33859125
H  1.30571562 -3.95587134 1.11936543
H  1.88910142 -2.43865665 1.81418568
H  0.21559404 -2.9478175 2.06715092
C  1.42250826 1.55477922 0.3547954
C  0.28645064 2.1715713 1.19162737
H  0.53971326 3.22726576 1.32824543
H  0.30280661 1.74619245 2.19931321
C  1.74207206 2.3879729 -0.90394637
H  2.64817191 2.0448499 -1.40442338
H  0.93079726 2.37794278 -1.63497747
H  1.90349538 3.42723621 -0.61145391
C  -1.84472986 0.73112275 0.63782684
C  -0.94672026 -0.41558286 1.21671932
H  -1.54923411 -1.31914198 1.34269318
C  1.77469563 -2.03801276 -0.95261236
H  -2.71801106 0.78662703 1.29352032
H  -0.61832319 -0.12799561 2.21711558
C  -1.13248153 2.11027573 0.61781198
H  3.20560387 -0.7714649 0.12764392
H  -0.21990865 -2.74325832 -0.39734309
H  2.4974121 -2.85393048 -0.90269722
H  1.38319134 -2.01280553 -1.97441988
H  2.33162479 1.60821213 0.9758274
H  -0.34562175 -0.35579759 -0.88351476
H  -1.13995269 2.52446804 -0.39460718
H  -1.74586435 2.79915043 1.20421169
C  -2.27254802 0.16815343 -0.68184041
C  -1.41843785 0.24352584 -1.75502789
H  -1.6384596 -0.30643897 -2.66505164
H  -0.75333537 1.09325558 -1.8758251
C  -3.48915103 -0.69125961 -0.71150711
H  -3.62796352 -1.25982202 0.21138249
H  -4.36058424 -0.02896179 -0.79944307
H  -3.50513773 -1.36752483 -1.5669056
