program: Gaussian 16
title: Title Card Required
version: ES64L-G16RevC.01
frameworkgroup: C1[X(C15H25)]
method: RmPW1PW91
basis: 6-31+G(d,p)
operation: Freq
keyword: #N
keyword: Geom=AllCheck
keyword: Guess=TCheck
keyword: SCRF=Check
keyword: GenChk
keyword: RmPW1PW91/6-31+G(d,p)
keyword: Freq
converged: YES YES YES YES
title: Mulliken charges:
elementType: C C C H C C H H H C C H H C H H H C C H C H H C H H H H H H H H C C H H C H H H
charge: -0.236882 -0.325904 -0.279692 0.246061 0.347613 -0.581013 0.198460 0.161646 0.191689 0.101558 -0.476650 0.196513 0.190877 -0.561790 0.192164 0.197236 0.214380 -0.095807 -0.507362 0.204148 -0.320612 0.189003 0.207967 -0.227909 0.234208 0.192175 0.200008 0.209710 0.199844 0.235519 0.147697 0.209783 0.277735 -0.365615 0.176416 0.136828 -0.622482 0.157982 0.195074 0.189425
chargesum: 1.00000
title: Mulliken charges with hydrogens summed into heavy atoms:
elementType: C C C C C C C C C C C C C C C
charge: 0.243386 -0.325904 -0.087517 0.583132 -0.029219 0.301402 -0.089260 0.041990 0.093196 -0.095247 0.089106 0.129571 0.277735 -0.052371 -0.080001
1716.lowfreq: -9.5894 -4.3024 -0.6054 -0.0007 -0.0006 -0.0002 51.1086 59.0725 75.9687
frequency: 51.1081 59.0721 75.9685 94.5257 150.9157 161.5279 176.8782 185.7541 207.7964 228.7764 235.7206 245.9038 253.0178 292.5686 326.3808 341.4089 361.7084 396.1832 475.2157 483.8719 487.0586 506.3942 539.1466 583.7760 612.3365 652.6939 703.1537 735.5840 788.0364 804.6358 832.1322 843.5056 876.9950 893.5770 918.4237 932.9061 945.0063 951.0470 955.4448 969.8150 992.6810 1002.6699 1008.2992 1014.0204 1034.1679 1048.0459 1055.3174 1067.1328 1097.1140 1120.5683 1126.3527 1141.5446 1160.4217 1171.6311 1197.5567 1208.9398 1221.2987 1234.9625 1248.8058 1265.6109 1292.0988 1304.9182 1319.6767 1324.5488 1345.4070 1348.1008 1350.5786 1364.1430 1377.7352 1390.4805 1400.8958 1410.2293 1417.4109 1426.2254 1432.4602 1442.1763 1457.0271 1460.7250 1479.8485 1489.5710 1491.2597 1497.5386 1497.8479 1501.4215 1503.0862 1510.1897 1514.7333 1518.8578 1729.5566 2988.6276 3031.1875 3051.8766 3054.4229 3059.2260 3075.7407 3076.0706 3084.6170 3095.1555 3098.8038 3099.5686 3119.1986 3126.8484 3132.2023 3140.9856 3144.2904 3154.7661 3160.1457 3166.7409 3169.9124 3171.7039 3174.8157 3186.3815 3192.4542 3275.5148
redmass: 2.6956 3.0170 3.2885 2.8205 2.6412 1.0565 2.1165 1.7717 1.1523 2.3333 1.5214 2.4940 2.4794 2.2244 2.3528 2.6228 2.5719 2.8062 2.5948 1.8988 2.3268 2.5625 2.4802 2.1693 2.4597 2.7528 2.0754 1.3151 2.1226 2.1603 3.0746 2.6189 2.7244 2.3672 2.1718 1.8951 1.6210 1.3489 1.8504 1.9773 1.5432 1.7239 1.8576 1.3874 1.4427 1.6538 1.7558 1.5238 2.0423 1.8968 1.6561 2.1883 1.4528 2.0963 1.4235 1.5005 1.5286 1.4693 1.2665 1.5898 1.2946 1.5243 1.3683 1.2911 1.4357 1.3648 1.3523 1.3607 1.5102 1.4416 1.2273 1.3549 1.5009 1.2548 1.2901 1.5827 1.2573 1.4628 1.2971 1.0573 1.0617 1.0694 1.0727 1.0932 1.0566 1.0956 1.0543 1.1738 5.0386 1.0720 1.0720 1.0807 1.0844 1.0420 1.0377 1.0651 1.0349 1.0677 1.0633 1.0844 1.0997 1.0879 1.1007 1.0886 1.1018 1.1013 1.0876 1.1029 1.1004 1.1032 1.1001 1.1037 1.0618 1.1155
irintensity: 0.0565 0.1009 1.1558 1.8619 1.0669 0.2067 6.7988 0.5746 0.9675 0.1674 0.2809 0.6477 6.4552 1.1963 1.0640 1.0649 1.0192 0.2712 0.9277 5.4112 1.5178 8.0453 1.8798 2.2705 3.6973 0.0788 36.7801 1.5999 2.5239 40.8066 8.7687 10.4754 4.2208 11.2005 39.3563 0.5058 3.4857 43.2314 1.6574 10.2238 2.9208 12.7598 8.0852 7.3844 5.9214 2.3672 9.5255 2.4926 11.8388 13.9067 0.9032 2.5121 11.7163 1.3853 6.7545 6.6265 4.6435 7.5670 1.7712 4.6586 6.1181 11.0245 5.7832 3.5477 2.1365 7.7977 10.3057 9.9997 20.1237 2.7092 14.6586 14.2179 4.0625 12.7005 9.9611 8.2112 2.5439 1.8950 20.8385 16.7048 8.0176 13.6247 18.2901 14.8047 8.7135 0.5984 33.0039 26.6609 13.7639 31.6401 14.6878 9.9717 6.6699 18.5529 9.3761 9.1230 4.0925 11.7277 11.2404 7.7932 12.3394 1.4545 8.6549 2.1259 10.9110 14.2455 5.8277 6.5569 5.7623 5.1041 10.2048 5.9604 3.0805 8.3397
temp: 298.150 k
press: 1.00000 atm
elementType: 6 6 6 1 6 6 1 1 1 6 6 1 1 6 1 1 1 6 6 1 6 1 1 6 1 1 1 1 1 1 1 1 6 6 1 1 6 1 1 1
symmnumber: 1
zpe: 971266.7 jmol-1
zpe.correction: 0.369936 hartree
zpe.thermalcorrener: 0.385950 hartree
zpe.thermalcorrenthalpy: 0.386894 hartree
zpe.thermalcorrgfe: 0.327755 hartree
zpe.sumelectzpe: -585.917209 hartree
zpe.sumelectthermal: -585.901194 hartree
zpe.sumelectthermalent: -585.900250 hartree
zpe.sumelectthermalfe: -585.959389 hartree
dipole: 4.2195 0.6263 0.7631
dipole: 4.3334
quadrupole: -68.2653 -74.9883 -85.0680
quadrupole: 1.8986 -0.3438 -0.3467
quadrupole: 7.8419 1.1189 -8.9608 1.8986 -0.3438 -0.3467
hfenergy: -586.2871446 hartree
pointgroup: C01 [X(C15H25)]
dipole: -0.0269397 -0.3317279 1.6720847 debye
polarizability: 145.0481135|-7.8386601|161.5894762|-4.9133298|-7.2815859|177.4887256 unknown
InChI: InChI=1S/C15H25/c1-10(2)13-7-5-11(3)14-8-6-12(4)15(14)9-13/h11-13,15H,1,5-9H2,2-4H3
charge 1 multiplicity 1
40 atoms
C  -1.10259644 -0.01165627 2.50285798
C  -0.75435645 -0.79299134 1.29870743
C  -2.48513267 0.73746128 0.67853979
H  -1.76352349 -0.70696395 3.05643861
C  -1.39696124 -0.21264289 0.13579811
C  -2.94896645 1.84304722 -0.25677839
H  -3.78781014 2.38100521 0.19048392
H  -2.16621334 2.58099387 -0.45325777
H  -3.28806034 1.44023371 -1.21408893
C  0.08924518 -2.00346343 1.33949419
C  1.21775392 -2.04554113 0.2776969
H  1.64764344 -3.04863071 0.34923174
H  2.01235193 -1.35369708 0.57894569
C  -0.87490546 -3.21352664 1.20974768
H  -1.65571572 -3.20142807 1.97327966
H  -1.34989138 -3.25836027 0.22879733
H  -0.28678441 -4.12268517 1.35209705
C  0.6296279 -0.27781602 -1.49267815
C  -0.06631649 0.50533664 -0.3636115
H  -0.38047376 1.50304449 -0.67823292
C  -1.88696052 1.20841388 2.01330191
H  1.6401611 0.14953737 -1.54958992
H  0.64794458 0.68705792 0.45344513
C  0.79421113 -1.76919327 -1.16282594
H  -0.25630398 0.16360745 3.17405637
H  -3.35100188 0.09788955 0.89782021
H  -1.20571986 2.05092429 1.8543996
H  -2.64418441 1.53500322 2.72694331
H  0.55573587 -2.06126369 2.32799597
H  -1.71899697 -0.88670058 -0.6584615
H  -0.12253394 -2.32296939 -1.38277178
H  1.54555197 -2.17923578 -1.84222443
C  -0.0434148 0.00844318 -2.82475934
C  -0.87678598 -0.84208521 -3.43471283
H  -1.33700758 -0.58136483 -4.38170819
H  -1.11355403 -1.82799647 -3.05075901
C  0.30702782 1.33466418 -3.44315027
H  0.13602763 2.17367316 -2.75989509
H  1.36919592 1.36164602 -3.71050642
H  -0.27197015 1.52042763 -4.3484085
