program: Gaussian 16
title: Title Card Required
version: ES64L-G16RevA.03
method: RM062X
basis: 6-311G(d,p)
operation: Freq
keyword: #P
keyword: Geom=AllCheck
keyword: Guess=TCheck
keyword: SCRF=Check
keyword: GenChk
keyword: RM062X/6-311G(d,p)
keyword: Freq
converged: YES YES NO YES
title: Mulliken charges:
elementType: C C C C C C C C O C C O C H H O H H H C H H O H H H H H C H H H O C H H H H
charge: -0.151298 -0.148791 0.175021 -0.138046 -0.161847 -0.125538 -0.240217 -0.092094 -0.363598 -0.045624 0.209168 -0.404761 0.482280 0.155003 0.159449 -0.380490 0.185898 0.213606 0.181665 -0.323246 0.213939 0.229135 -0.351007 0.172940 0.177257 0.167491 0.253778 0.154324 -0.230597 0.168785 0.151500 0.155318 -0.202358 -0.180389 0.192081 0.208017 0.210164 0.323085
chargesum: 1.00000
title: Mulliken charges with hydrogens summed into heavy atoms:
elementType: C C C C C C C C O C C O C O C O C O C
charge: 0.003705 0.010658 0.175021 0.047853 -0.161847 0.028785 0.155054 -0.092094 -0.363598 0.397449 0.462946 -0.404761 0.482280 -0.380490 0.194441 -0.027922 0.245006 -0.202358 0.429873
polarizability: 2.29455878e+02 4.41462267e+00 2.21833670e+02 -2.63361473e+01 2.25776063e+01 1.83262737e+02
1716.lowfreq: -126.3380 -0.0004 0.0003 0.0004 7.4704 14.0970 25.3636 37.1935 65.0085
frequency: -125.9262 36.3807 64.4151 73.7390 80.5524 106.8936 110.0316 113.8262 142.5727 148.0914 176.3846 204.4617 233.9630 235.7038 264.0185 279.5108 284.3973 297.6963 315.8981 321.1856 346.8990 378.9368 407.1929 457.3758 467.9135 483.0673 517.2927 566.5033 576.2697 598.0002 601.1777 676.4283 680.5558 714.1815 753.1407 765.6147 806.1924 810.3778 863.0401 878.6257 899.8289 909.3158 921.0261 935.1722 982.6920 996.4550 1000.6001 1015.5351 1029.1524 1094.1915 1110.1367 1114.2420 1122.5638 1149.9458 1176.2935 1180.5106 1186.9059 1187.5909 1202.9062 1217.5213 1225.8441 1227.7851 1258.3346 1273.6873 1288.5031 1310.1577 1325.3874 1359.2684 1380.4652 1404.0818 1421.9548 1428.5548 1453.4123 1458.6594 1465.6521 1472.6760 1475.1420 1479.4237 1493.0546 1498.1860 1499.2304 1502.4484 1506.8514 1510.4676 1545.4672 1661.5374 1672.1122 1704.3917 1813.8687 2973.8116 3048.2519 3079.0936 3091.1090 3107.3020 3117.2048 3139.9235 3141.4595 3163.5281 3175.9290 3179.8512 3180.9518 3200.8343 3214.0245 3218.6142 3227.1380 3229.1436 3253.8238 3737.0537
redmass: 2.6703 4.2123 4.7988 3.4986 4.6227 2.8075 3.5954 1.8988 4.2641 2.4685 3.1012 3.6780 2.5017 2.7921 4.6966 2.8833 1.3324 3.2447 1.6071 2.5856 4.1459 2.5324 4.2049 3.2907 4.4118 3.7755 5.1887 4.8329 4.4593 4.1541 1.2061 4.0029 2.9575 2.5344 3.7214 3.8091 5.7108 1.5517 2.2035 1.5429 2.1744 1.7415 2.1376 2.0352 2.1373 2.6180 1.2908 5.2160 3.3567 3.9649 1.8151 1.6267 2.3029 1.8873 1.1947 2.5246 1.3228 1.2780 1.4392 1.5757 1.6776 1.9444 3.3709 1.2426 1.7806 3.3389 1.6605 1.5910 2.0256 1.6575 1.2574 1.8330 1.2483 1.1070 1.0779 1.2102 1.6793 1.0765 1.1495 1.1498 1.0770 1.1895 1.0950 1.2679 2.3911 6.7810 5.7264 4.9691 10.9177 1.0692 1.0346 1.0348 1.0635 1.0270 1.1073 1.1020 1.0891 1.1047 1.1043 1.1016 1.0953 1.0886 1.0923 1.1113 1.0969 1.1112 1.0895 1.0651
irintensity: 69.9671 3.4850 5.1476 0.9113 3.2870 9.1367 6.2185 3.1903 10.4175 23.9809 16.0410 5.5416 1.0321 2.0904 3.3696 2.0422 0.7976 2.3740 2.5570 3.5756 3.2299 7.1617 0.8300 2.2933 1.7452 13.0797 7.3175 9.2282 1.7417 25.3484 148.3854 58.5637 5.3396 37.9609 31.3964 37.4536 33.3424 63.2878 2.7790 33.9692 11.1931 23.7342 50.1974 31.4983 62.2998 17.8590 0.3183 1.7305 55.6880 60.3375 27.0360 3.8963 78.1987 53.4779 4.8005 15.4426 13.4600 1.4496 40.7095 50.3515 112.6476 286.3126 50.5196 6.5851 4.1227 195.5909 71.3055 33.8931 67.1743 55.1254 32.9460 53.4472 10.0311 25.2419 25.0462 20.4654 45.9617 9.6867 3.5946 5.5250 27.6721 21.6680 81.1974 87.4879 112.4069 41.4606 162.3776 286.5220 567.9143 37.1681 42.8881 8.1709 8.2321 1.1494 35.6457 7.5023 3.2271 13.3234 3.9120 20.5107 4.6868 4.3770 9.4684 0.5051 2.2805 0.3359 2.1239 287.2383
temp: 298.150 k
press: 1.00000 atm
elementType: 6 6 6 6 6 6 6 6 8 6 6 8 6 1 1 8 1 1 1 6 1 1 8 1 1 1 1 1 6 1 1 1 8 6 1 1 1 1
symmnumber: 1
zpe: 836588.9 jmol-1
zpe.correction: 0.318640 hartree
zpe.thermalcorrener: 0.337126 hartree
zpe.thermalcorrenthalpy: 0.338070 hartree
zpe.thermalcorrgfe: 0.272552 hartree
zpe.sumelectzpe: -920.386024 hartree
zpe.sumelectthermal: -920.367538 hartree
zpe.sumelectthermalent: -920.366594 hartree
zpe.sumelectthermalfe: -920.432111 hartree
dipole: -9.3718 5.5454 -0.3990
dipole: 10.8968
quadrupole: -83.0329 -76.1667 -101.7227
quadrupole: -18.1508 -11.2267 1.4025
quadrupole: 3.9412 10.8074 -14.7486 -18.1508 -11.2267 1.4025
hfenergy: -920.7046638 hartree
pointgroup: C01 [X(C14H19O5)]
dipole: -3.6783966 2.3684576 -0.4698283 debye
polarizability: 229.4558777|4.4146227|221.83367|-26.3361473|22.5776063|183.2627366 unknown
InChI: InChI=1S/C14H19O5/c1-14(13(15)16,19-8-7-17-2)10-11-5-4-6-12(9-11)18-3/h4-7,9,15H,8,10H2,1-3H3
charge 1 multiplicity 1
38 atoms
C  2.1858436 1.84209317 1.52239396
C  3.20425266 1.29148778 0.76580981
C  3.04254746 0.01615611 0.20918252
C  1.85887137 -0.68922638 0.41403767
C  0.8207772 -0.11861397 1.16281383
C  0.99244441 1.14480053 1.71991663
C  -0.46892997 -0.87636041 1.38601697
C  -1.18613323 -1.35086815 0.07531804
O  -0.61635183 -0.86380502 -1.12772325
C  -0.63323946 0.47584703 -1.54500642
C  -1.53797144 1.46454555 -0.91248258
O  -3.22741256 -0.33205058 -0.74832035
C  -2.67321777 -1.00166633 0.09270353
H  2.31747838 2.824104 1.96218957
H  4.13614709 1.81741515 0.5951477
O  4.08978518 -0.44904937 -0.51241429
H  1.72552303 -1.67429783 -0.01179053
H  -0.25818952 -1.77258858 1.97460204
H  -1.14012414 -0.2621255 1.98671469
C  -1.09183851 -2.87300602 -0.07309363
H  -0.86644426 0.47717191 -2.61011912
H  0.36467511 0.93921451 -1.42127117
O  -3.30002092 -1.5290177 1.13417879
H  -1.53529849 -3.36136736 0.79393767
H  -0.04104568 -3.15708394 -0.14229281
H  -1.60975958 -3.19498316 -0.97822179
H  -2.048906 2.19122153 -1.54799069
H  0.19749368 1.58187158 2.31368404
C  3.96049064 -1.72621887 -1.11851294
H  4.88968585 -1.89719348 -1.6578729
H  3.12212216 -1.74572551 -1.8216786
H  3.82790636 -2.50936039 -0.36643945
O  -1.61560727 1.5887631 0.32564528
C  -2.49136509 2.5954266 0.92389959
H  -2.9166019 3.21722193 0.13807473
H  -3.25594721 2.04013511 1.46234297
H  -1.86473005 3.16475472 1.60447795
H  -4.24341331 -1.29456976 1.09133553
